null
SMILES:
InChI Key: InChIKey=LLHSWSRTBINBNJ-ZEQRLZLVSA-N
Activity Spreadsheet -- Enzyme Inhibition Constant Data from BindingDB
Found 1 hit for monomerid = 50290976
Trg + Lig
Ki
nM
ΔG°
kcal/mole
IC50
nM
Kd
nM
EC50/IC50
nM
koff
s-1
kon
M-1s-1
pHTemp
°C
Kappa-type opioid receptor
(Homo sapiens (Human))
BDBM50290976
(1-[Methyl-((1S,2S)-2-pyrrolidin-1-yl-cyclohexyl)-c...)
Show InChI InChI=1S/C29H34N2O3/c1-30(23-17-9-10-18-24(23)31-19-11-12-20-31)27(32)29(28(33)34-2)25(21-13-5-3-6-14-21)26(29)22-15-7-4-8-16-22/h3-8,13-16,23-24H,9-12,17-20H2,1-2H3/t23-,24-/m0/s1
Reactome pathway
n/an/an/an/a 3.00E+3n/an/an/an/a
TBA
Curated by ChEMBL
Assay Description
Inhibition of Opioid receptor kappa 1 as reduced contraction in electrically stimulated rabbit vas deferens
Bioorg Med Chem Lett 7: 291-296 (1997)
Article DOI: 10.1016/S0960-894X(96)00615-4
BindingDB Entry DOI: 10.7270/Q2G160VS