BDBM50291438 CHEMBL4161065
SMILES: [Br-].COc1ccc2C(=O)C(Cc3cc[n+](Cc4ccccc4C)cc3C(C)=O)CCc2c1
InChI Key: InChIKey=QKFKNUNYXQVNHL-UHFFFAOYSA-M
Data: 2 IC50
Activity Spreadsheet -- Enzyme Inhibition Constant Data from BindingDB
Found 2 hits for monomerid = 50291438
Trg + Lig
Ki
nM
ΔG°
kcal/mole
IC50
nM
Kd
nM
EC50/IC50
nM
koff
s-1
kon
M-1s-1
pHTemp
°C
Acetylcholinesterase
(Homo sapiens (Human))
BDBM50291438
(CHEMBL4161065)
Show SMILES [Br-].COc1ccc2C(=O)C(Cc3cc[n+](Cc4ccccc4C)cc3C(C)=O)CCc2c1
Show InChI InChI=1S/C27H28NO3.BrH/c1-18-6-4-5-7-23(18)16-28-13-12-21(26(17-28)19(2)29)14-22-9-8-20-15-24(31-3)10-11-25(20)27(22)30;/h4-7,10-13,15,17,22H,8-9,14,16H2,1-3H3;1H/q+1;/p-1
NCI pathway
Reactome pathway
n/an/a 10n/an/an/an/an/an/a
VFP Therapies
Curated by ChEMBL
Assay Description
Inhibition of human erythrocyte AChE using acetylthiocholine iodide as substrate preincubated for 5 mins followed by substrate addition measured ever...
Eur J Med Chem 145: 165-190 (2018)
Article DOI: 10.1016/j.ejmech.2017.12.084
BindingDB Entry DOI: 10.7270/Q2FN18RR
Cholinesterase
(Equus caballus (Horse))
BDBM50291438
(CHEMBL4161065)
Show SMILES [Br-].COc1ccc2C(=O)C(Cc3cc[n+](Cc4ccccc4C)cc3C(C)=O)CCc2c1
Show InChI InChI=1S/C27H28NO3.BrH/c1-18-6-4-5-7-23(18)16-28-13-12-21(26(17-28)19(2)29)14-22-9-8-20-15-24(31-3)10-11-25(20)27(22)30;/h4-7,10-13,15,17,22H,8-9,14,16H2,1-3H3;1H/q+1;/p-1
n/an/a 433n/an/an/an/an/an/a
VFP Therapies
Curated by ChEMBL
Assay Description
Inhibition of equine serum BChE using butyrylthiocholine iodide as substrate preincubated for 5 mins followed by substrate addition measured every mi...
Eur J Med Chem 145: 165-190 (2018)
Article DOI: 10.1016/j.ejmech.2017.12.084
BindingDB Entry DOI: 10.7270/Q2FN18RR