BDBM50292409 (Z)-7-((1R,4S,5S,6R)-6-((S,E)-3-hydroxyoct-1-enyl)-2-oxabicyclo[2.2.1]heptan-5-yl)hept-5-enoic acid::CHEMBL521784
SMILES: CCCCC[C@H](O)\C=C\[C@H]1[C@H]2C[C@H](CO2)[C@@H]1C\C=C/CCCC(O)=O
InChI Key: InChIKey=LQANGKSBLPMBTJ-BRSNVKEHSA-N
Data: 1 KI  1 IC50
PDB links: 1 PDB ID matches this monomer.
Activity Spreadsheet -- Enzyme Inhibition Constant Data from BindingDB
Found 2 hits for monomerid = 50292409
Trg + Lig
Ki
nM
ΔG°
kcal/mole
IC50
nM
Kd
nM
EC50/IC50
nM
koff
s-1
kon
M-1s-1
pHTemp
°C
Prostanoid TP receptor
(Homo sapiens (Human))
BDBM50292409
((Z)-7-((1R,4S,5S,6R)-6-((S,E)-3-hydroxyoct-1-enyl)...)
Show SMILES CCCCC[C@H](O)\C=C\[C@H]1[C@H]2C[C@H](CO2)[C@@H]1C\C=C/CCCC(O)=O |r|
Show InChI InChI=1S/C21H34O4/c1-2-3-6-9-17(22)12-13-19-18(16-14-20(19)25-15-16)10-7-4-5-8-11-21(23)24/h4,7,12-13,16-20,22H,2-3,5-6,8-11,14-15H2,1H3,(H,23,24)/b7-4-,13-12+/t16-,17+,18+,19-,20-/m1/s1
5.5n/an/an/an/an/an/an/an/a
TBA
Curated by ChEMBL
Assay Description
Displacement of [3H]SQ29548 from thromboxane A2 receptor
J Nat Prod 56: 441-455 (1993)
Article DOI: 10.1021/np50094a001
BindingDB Entry DOI: 10.7270/Q2VT1S4B
Prostanoid TP receptor
(Homo sapiens (Human))
BDBM50292409
((Z)-7-((1R,4S,5S,6R)-6-((S,E)-3-hydroxyoct-1-enyl)...)
Show SMILES CCCCC[C@H](O)\C=C\[C@H]1[C@H]2C[C@H](CO2)[C@@H]1C\C=C/CCCC(O)=O |r|
Show InChI InChI=1S/C21H34O4/c1-2-3-6-9-17(22)12-13-19-18(16-14-20(19)25-15-16)10-7-4-5-8-11-21(23)24/h4,7,12-13,16-20,22H,2-3,5-6,8-11,14-15H2,1H3,(H,23,24)/b7-4-,13-12+/t16-,17+,18+,19-,20-/m1/s1
n/an/a 31n/an/an/an/an/an/a
Takeda Chemical Industries, Ltd.
Curated by ChEMBL
Assay Description
In vitro concentration of the compound that reduced specific binding of [3H]-U-440619 to guinea pig platelet receptor, Thromboxane A2 receptor by 50%
J Med Chem 32: 2214-21 (1989)
BindingDB Entry DOI: 10.7270/Q2WH2P0W