BDBM50292475 CHEMBL510130::hypophyllanthin
SMILES: COC[C@@H]1Cc2cc(OC)c3OCOc3c2[C@@H]([C@H]1COC)c1ccc(OC)c(OC)c1
InChI Key: InChIKey=LBJCUHLNHSKZBW-XGHQBKJUSA-N
Data: 3 IC50
Activity Spreadsheet -- Enzyme Inhibition Constant Data from BindingDB
Found 3 hits for monomerid = 50292475
Trg + Lig
Ki
nM
ΔG°
kcal/mole
IC50
nM
Kd
nM
EC50/IC50
nM
koff
s-1
kon
M-1s-1
pHTemp
°C
EDNRA
(RAT)
BDBM50292475
(CHEMBL510130 | hypophyllanthin)
Show SMILES COC[C@@H]1Cc2cc(OC)c3OCOc3c2[C@@H]([C@H]1COC)c1ccc(OC)c(OC)c1 |r|
Show InChI InChI=1S/C24H30O7/c1-25-11-16-8-15-10-20(29-5)23-24(31-13-30-23)22(15)21(17(16)12-26-2)14-6-7-18(27-3)19(9-14)28-4/h6-7,9-10,16-17,21H,8,11-13H2,1-5H3/t16-,17-,21+/m0/s1
Reactome pathway
n/an/a 5.80E+5n/an/an/an/an/an/a
TBA
Curated by ChEMBL
Assay Description
Displacement of [125I]endothelin-1 from ETA receptor in rat A10 cells by scintillation counting
J Nat Prod 58: 1515-1520 (1995)
Article DOI: 10.1021/np50124a006
BindingDB Entry DOI: 10.7270/Q2ST7PV5
EDNRB
(Homo sapiens (Human))
BDBM50292475
(CHEMBL510130 | hypophyllanthin)
Show SMILES COC[C@@H]1Cc2cc(OC)c3OCOc3c2[C@@H]([C@H]1COC)c1ccc(OC)c(OC)c1 |r|
Show InChI InChI=1S/C24H30O7/c1-25-11-16-8-15-10-20(29-5)23-24(31-13-30-23)22(15)21(17(16)12-26-2)14-6-7-18(27-3)19(9-14)28-4/h6-7,9-10,16-17,21H,8,11-13H2,1-5H3/t16-,17-,21+/m0/s1
n/an/a>5.00E+5n/an/an/an/an/an/a
TBA
Curated by ChEMBL
Assay Description
Displacement of [125I]endothelin-1 from human recombinant ETB receptor expressed in CHO cells
J Nat Prod 58: 1515-1520 (1995)
Article DOI: 10.1021/np50124a006
BindingDB Entry DOI: 10.7270/Q2ST7PV5
Endothelin-1 receptor
(Homo sapiens (Human))
BDBM50292475
(CHEMBL510130 | hypophyllanthin)
Show SMILES COC[C@@H]1Cc2cc(OC)c3OCOc3c2[C@@H]([C@H]1COC)c1ccc(OC)c(OC)c1 |r|
Show InChI InChI=1S/C24H30O7/c1-25-11-16-8-15-10-20(29-5)23-24(31-13-30-23)22(15)21(17(16)12-26-2)14-6-7-18(27-3)19(9-14)28-4/h6-7,9-10,16-17,21H,8,11-13H2,1-5H3/t16-,17-,21+/m0/s1
n/an/a 4.00E+4n/an/an/an/an/an/a
TBA
Curated by ChEMBL
Assay Description
Displacement of [125I]endothelin-1 from human recombinant ETA receptor expressed in CHO cells
J Nat Prod 58: 1515-1520 (1995)
Article DOI: 10.1021/np50124a006
BindingDB Entry DOI: 10.7270/Q2ST7PV5