BDBM50292521 2-cyano-3-(3,4-dihydroxyphenyl)-N-(4-phenylbutyl)acrylamide::CHEMBL490577
SMILES: Oc1ccc(\C=C(\C#N)C(=O)NCCCCc2ccccc2)cc1O
InChI Key: InChIKey=GWCNJMUSWLTSCW-ATVHPVEESA-N
Data: 1 IC50
Activity Spreadsheet -- Enzyme Inhibition Constant Data from BindingDB
Found 1 hit for monomerid = 50292521
Trg + Lig
Ki
nM
ΔG°
kcal/mole
IC50
nM
Kd
nM
EC50/IC50
nM
koff
s-1
kon
M-1s-1
pHTemp
°C
Epidermal growth factor receptor
(Homo sapiens (Human))
BDBM50292521
(2-cyano-3-(3,4-dihydroxyphenyl)-N-(4-phenylbutyl)a...)
Show SMILES Oc1ccc(\C=C(\C#N)C(=O)NCCCCc2ccccc2)cc1O
Show InChI InChI=1S/C20H20N2O3/c21-14-17(12-16-9-10-18(23)19(24)13-16)20(25)22-11-5-4-8-15-6-2-1-3-7-15/h1-3,6-7,9-10,12-13,23-24H,4-5,8,11H2,(H,22,25)/b17-12-
n/an/a 1n/an/an/an/an/an/a
TBA
Curated by ChEMBL
Assay Description
Inhibition of EGFR in human A431 cells
J Nat Prod 55: 1529-1560 (1992)
Article DOI: 10.1021/np50089a001
BindingDB Entry DOI: 10.7270/Q2J966CC