BDBM50292544 3,4,6,7-tetrahydroxyxanthone::CHEMBL477740
SMILES: Oc1ccc2c(oc3cc(O)c(O)cc3c2=O)c1O
InChI Key: InChIKey=ZIUFQHOTGSSKBS-UHFFFAOYSA-N
Data: 1 KI  1 IC50
Activity Spreadsheet -- Enzyme Inhibition Constant Data from BindingDB
Found 2 hits for monomerid = 50292544
Trg + Lig
Ki
nM
ΔG°
kcal/mole
IC50
nM
Kd
nM
EC50/IC50
nM
koff
s-1
kon
M-1s-1
pHTemp
°C
Angiotensin-converting enzyme
(Homo sapiens (Human))
BDBM50292544
(3,4,6,7-tetrahydroxyxanthone | CHEMBL477740)
Show SMILES Oc1ccc2c(oc3cc(O)c(O)cc3c2=O)c1O
Show InChI InChI=1S/C13H8O6/c14-7-2-1-5-11(17)6-3-8(15)9(16)4-10(6)19-13(5)12(7)18/h1-4,14-16,18H
Reactome pathway
1.42E+4n/an/an/an/an/an/an/an/a
TBA
Curated by ChEMBL
Assay Description
Inhibition of ACE by Lineweaver-Burk plot
J Nat Prod 55: 691-695 (1992)
Article DOI: 10.1021/np50083a025
BindingDB Entry DOI: 10.7270/Q21C1WXZ
Angiotensin-converting enzyme
(Homo sapiens (Human))
BDBM50292544
(3,4,6,7-tetrahydroxyxanthone | CHEMBL477740)
Show SMILES Oc1ccc2c(oc3cc(O)c(O)cc3c2=O)c1O
Show InChI InChI=1S/C13H8O6/c14-7-2-1-5-11(17)6-3-8(15)9(16)4-10(6)19-13(5)12(7)18/h1-4,14-16,18H
Reactome pathway
n/an/a 3.54E+4n/an/an/an/an/an/a
TBA
Curated by ChEMBL
Assay Description
Inhibition of ACE
J Nat Prod 55: 691-695 (1992)
Article DOI: 10.1021/np50083a025
BindingDB Entry DOI: 10.7270/Q21C1WXZ