BDBM50293121 CHEMBL129236::N-(4-(benzo[d]thiazol-2-yl)phenyl)acetamide::N-(4-Benzothiazol-2-yl-phenyl)-acetamide
SMILES: CC(=O)Nc1ccc(cc1)-c1nc2ccccc2s1
InChI Key: InChIKey=SMYRLHVRGXBMTQ-UHFFFAOYSA-N
Data: 3 IC50
Activity Spreadsheet -- Enzyme Inhibition Constant Data from BindingDB
Found 3 hits for monomerid = 50293121
Trg + Lig
Ki
nM
ΔG°
kcal/mole
IC50
nM
Kd
nM
EC50/IC50
nM
koff
s-1
kon
M-1s-1
pHTemp
°C
Luciferin 4-monooxygenase
(Photuris pennsylvanica)
BDBM50293121
(CHEMBL129236 | N-(4-(benzo[d]thiazol-2-yl)phenyl)a...)
Show SMILES CC(=O)Nc1ccc(cc1)-c1nc2ccccc2s1
Show InChI InChI=1S/C15H12N2OS/c1-10(18)16-12-8-6-11(7-9-12)15-17-13-4-2-3-5-14(13)19-15/h2-9H,1H3,(H,16,18)
n/an/a 3.10E+3n/an/an/an/an/an/a
National Institutes of Health
Curated by ChEMBL
Assay Description
Inhibition of luciferin binding site of Photuris pennsylvanica luciferase by competitive inhibition assay
J Med Chem 52: 1450-8 (2010)
Article DOI: 10.1021/jm8014525
BindingDB Entry DOI: 10.7270/Q2XD11PW
Luciferin 4-monooxygenase
(Photuris pennsylvanica)
BDBM50293121
(CHEMBL129236 | N-(4-(benzo[d]thiazol-2-yl)phenyl)a...)
Show SMILES CC(=O)Nc1ccc(cc1)-c1nc2ccccc2s1
Show InChI InChI=1S/C15H12N2OS/c1-10(18)16-12-8-6-11(7-9-12)15-17-13-4-2-3-5-14(13)19-15/h2-9H,1H3,(H,16,18)
n/an/a>5.00E+4n/an/an/an/an/an/a
National Institutes of Health
Curated by ChEMBL
Assay Description
Inhibition of luciferin binding site of Photuris pennsylvanica luciferase by competitive KinaseGlo luminescent assay
J Med Chem 52: 1450-8 (2010)
Article DOI: 10.1021/jm8014525
BindingDB Entry DOI: 10.7270/Q2XD11PW
Luciferin 4-monooxygenase
(Photinus pyralis)
BDBM50293121
(CHEMBL129236 | N-(4-(benzo[d]thiazol-2-yl)phenyl)a...)
Show SMILES CC(=O)Nc1ccc(cc1)-c1nc2ccccc2s1
Show InChI InChI=1S/C15H12N2OS/c1-10(18)16-12-8-6-11(7-9-12)15-17-13-4-2-3-5-14(13)19-15/h2-9H,1H3,(H,16,18)
n/an/a 3.00E+3n/an/an/an/an/an/a
National Institutes of Health
Curated by ChEMBL
Assay Description
Inhibition of luciferin binding site of Photinus pyralis luciferase by competitive inhibition assay
J Med Chem 52: 1450-8 (2010)
Article DOI: 10.1021/jm8014525
BindingDB Entry DOI: 10.7270/Q2XD11PW