null
SMILES: ONC(=O)\C=C\C1CCC(CC1)c1ccc(O)cc1
InChI Key: InChIKey=SHUFNENTPLTSFW-XCVCLJGOSA-N
Activity Spreadsheet -- Enzyme Inhibition Constant Data from BindingDB
Found 1 hit for monomerid = 50293353
Trg + Lig
Ki
nM
ΔG°
kcal/mole
IC50
nM
Kd
nM
EC50/IC50
nM
koff
s-1
kon
M-1s-1
pHTemp
°C
Histone deacetylase 2
(Homo sapiens (Human))
BDBM50293353
(CHEMBL539156 | N-Hydroxy-E-3-[4-(4-hydroxyphenyl)-...)
Show SMILES ONC(=O)\C=C\C1CCC(CC1)c1ccc(O)cc1 |(22.52,-21.14,;21.19,-21.91,;19.85,-21.14,;19.85,-19.6,;18.52,-21.91,;17.19,-21.14,;15.85,-21.91,;15.85,-23.45,;14.53,-24.22,;13.19,-23.46,;13.18,-21.92,;14.52,-21.15,;11.86,-24.24,;10.52,-23.48,;9.2,-24.25,;9.2,-25.79,;7.86,-26.56,;10.53,-26.56,;11.87,-25.79,)|
Show InChI InChI=1S/C15H19NO3/c17-14-8-6-13(7-9-14)12-4-1-11(2-5-12)3-10-15(18)16-19/h3,6-12,17,19H,1-2,4-5H2,(H,16,18)/b10-3+
NCI pathway
Reactome pathway
n/an/a 310n/an/an/an/an/an/a
Universit£ di Milano
Curated by ChEMBL
Assay Description
Inhibition of HDAC2 in human HeLa cells
Eur J Med Chem 44: 1900-12 (2009)
Article DOI: 10.1016/j.ejmech.2008.11.005
BindingDB Entry DOI: 10.7270/Q2M045G2