BDBM50293379 (R)-N-(4-carbamimidoylbenzyl)-2-(4-oxo-3-(phenylmethylsulfonamido)-3,4-dihydrobenzo[b][1,4]thiazepin-5(2H)-yl)acetamide, trifluoroacetate::CHEMBL452174
SMILES: NC(=N)c1ccc(CNC(=O)CN2c3ccccc3SC[C@H](NS(=O)(=O)Cc3ccccc3)C2=O)cc1
InChI Key: InChIKey=LSLVCIWDJBWFRJ-NRFANRHFSA-N
Data: 3 IC50
Activity Spreadsheet -- Enzyme Inhibition Constant Data from BindingDB
Found 3 hits for monomerid = 50293379
Trg + Lig
Ki
nM
ΔG°
kcal/mole
IC50
nM
Kd
nM
EC50/IC50
nM
koff
s-1
kon
M-1s-1
pHTemp
°C
Coagulation factor VII/tissue factor
(Homo sapiens (Human))
BDBM50293379
((R)-N-(4-carbamimidoylbenzyl)-2-(4-oxo-3-(phenylme...)
Show SMILES NC(=N)c1ccc(CNC(=O)CN2c3ccccc3SC[C@H](NS(=O)(=O)Cc3ccccc3)C2=O)cc1 |r|
Show InChI InChI=1S/C26H27N5O4S2/c27-25(28)20-12-10-18(11-13-20)14-29-24(32)15-31-22-8-4-5-9-23(22)36-16-21(26(31)33)30-37(34,35)17-19-6-2-1-3-7-19/h1-13,21,30H,14-17H2,(H3,27,28)(H,29,32)/t21-/m0/s1
Reactome pathway
n/an/a 2.79E+4n/an/an/an/an/an/a
Universit£ Montpellier 1
Curated by ChEMBL
Assay Description
Inhibition of human tissue factor/factor 7a
Bioorg Med Chem Lett 19: 1386-91 (2009)
Article DOI: 10.1016/j.bmcl.2009.01.039
BindingDB Entry DOI: 10.7270/Q2G73DRB
Coagulation factor X
(Homo sapiens (Human))
BDBM50293379
((R)-N-(4-carbamimidoylbenzyl)-2-(4-oxo-3-(phenylme...)
Show SMILES NC(=N)c1ccc(CNC(=O)CN2c3ccccc3SC[C@H](NS(=O)(=O)Cc3ccccc3)C2=O)cc1 |r|
Show InChI InChI=1S/C26H27N5O4S2/c27-25(28)20-12-10-18(11-13-20)14-29-24(32)15-31-22-8-4-5-9-23(22)36-16-21(26(31)33)30-37(34,35)17-19-6-2-1-3-7-19/h1-13,21,30H,14-17H2,(H3,27,28)(H,29,32)/t21-/m0/s1
Reactome pathway
n/an/a 3.28E+3n/an/an/an/an/an/a
Universit£ Montpellier 1
Curated by ChEMBL
Assay Description
Inhibition of human factor 10a by spectrometry
Bioorg Med Chem Lett 19: 1386-91 (2009)
Article DOI: 10.1016/j.bmcl.2009.01.039
BindingDB Entry DOI: 10.7270/Q2G73DRB
Prothrombin
(Homo sapiens (Human))
BDBM50293379
((R)-N-(4-carbamimidoylbenzyl)-2-(4-oxo-3-(phenylme...)
Show SMILES NC(=N)c1ccc(CNC(=O)CN2c3ccccc3SC[C@H](NS(=O)(=O)Cc3ccccc3)C2=O)cc1 |r|
Show InChI InChI=1S/C26H27N5O4S2/c27-25(28)20-12-10-18(11-13-20)14-29-24(32)15-31-22-8-4-5-9-23(22)36-16-21(26(31)33)30-37(34,35)17-19-6-2-1-3-7-19/h1-13,21,30H,14-17H2,(H3,27,28)(H,29,32)/t21-/m0/s1
n/an/a 4.80E+4n/an/an/an/an/an/a
Universit£ Montpellier 1
Curated by ChEMBL
Assay Description
Inhibition of human factor 2a by spectrophotometry
Bioorg Med Chem Lett 19: 1386-91 (2009)
Article DOI: 10.1016/j.bmcl.2009.01.039
BindingDB Entry DOI: 10.7270/Q2G73DRB