BDBM50293396 (R)-2-(5-(3-(4-carbamimidoylbenzylamino)-3-oxopropyl)-4-oxo-2,3,4,5-tetrahydrobenzo[b][1,4]thiazepin-3-ylamino)acetic acid.2,2,2-trifluoroacetic acid::CHEMBL539993
SMILES: NC(=N)c1ccc(CNC(=O)CCN2c3ccccc3SC[C@H](NCC(O)=O)C2=O)cc1
InChI Key: InChIKey=SIWZMTQGCVYGLS-INIZCTEOSA-N
Data: 2 IC50
Activity Spreadsheet -- Enzyme Inhibition Constant Data from BindingDB
Found 2 hits for monomerid = 50293396
Trg + Lig
Ki
nM
ΔG°
kcal/mole
IC50
nM
Kd
nM
EC50/IC50
nM
koff
s-1
kon
M-1s-1
pHTemp
°C
Coagulation factor VII/tissue factor
(Homo sapiens (Human))
BDBM50293396
((R)-2-(5-(3-(4-carbamimidoylbenzylamino)-3-oxoprop...)
Show SMILES NC(=N)c1ccc(CNC(=O)CCN2c3ccccc3SC[C@H](NCC(O)=O)C2=O)cc1 |r|
Show InChI InChI=1S/C22H25N5O4S/c23-21(24)15-7-5-14(6-8-15)11-26-19(28)9-10-27-17-3-1-2-4-18(17)32-13-16(22(27)31)25-12-20(29)30/h1-8,16,25H,9-13H2,(H3,23,24)(H,26,28)(H,29,30)/t16-/m0/s1
Reactome pathway
n/an/a>3.30E+5n/an/an/an/an/an/a
Universit£ Montpellier 1
Curated by ChEMBL
Assay Description
Inhibition of human tissue factor/factor 7a
Bioorg Med Chem Lett 19: 1386-91 (2009)
Article DOI: 10.1016/j.bmcl.2009.01.039
BindingDB Entry DOI: 10.7270/Q2G73DRB
Prothrombin
(Homo sapiens (Human))
BDBM50293396
((R)-2-(5-(3-(4-carbamimidoylbenzylamino)-3-oxoprop...)
Show SMILES NC(=N)c1ccc(CNC(=O)CCN2c3ccccc3SC[C@H](NCC(O)=O)C2=O)cc1 |r|
Show InChI InChI=1S/C22H25N5O4S/c23-21(24)15-7-5-14(6-8-15)11-26-19(28)9-10-27-17-3-1-2-4-18(17)32-13-16(22(27)31)25-12-20(29)30/h1-8,16,25H,9-13H2,(H3,23,24)(H,26,28)(H,29,30)/t16-/m0/s1
n/an/a 3.30E+4n/an/an/an/an/an/a
Universit£ Montpellier 1
Curated by ChEMBL
Assay Description
Inhibition of human factor 2a by spectrophotometry
Bioorg Med Chem Lett 19: 1386-91 (2009)
Article DOI: 10.1016/j.bmcl.2009.01.039
BindingDB Entry DOI: 10.7270/Q2G73DRB