BDBM50293704 1,1,1-trifluoro-7-(1H-naphtho[2,3-d]imidazol-2-yl)heptan-2-one::CHEMBL550625
SMILES: FC(F)(F)C(=O)CCCCCc1nc2cc3ccccc3cc2[nH]1
InChI Key: InChIKey=XPKSIVBPJLDRCF-UHFFFAOYSA-N
Data: 1 KI  1 IC50
Activity Spreadsheet -- Enzyme Inhibition Constant Data from BindingDB
Found 2 hits for monomerid = 50293704
Trg + Lig
Ki
nM
ΔG°
kcal/mole
IC50
nM
Kd
nM
EC50/IC50
nM
koff
s-1
kon
M-1s-1
pHTemp
°C
Histone deacetylase-like amidohydrolase
(Alcaligenes sp. (strain DSM 11172) (Bordetella sp....)
BDBM50293704
(1,1,1-trifluoro-7-(1H-naphtho[2,3-d]imidazol-2-yl)...)
Show SMILES FC(F)(F)C(=O)CCCCCc1nc2cc3ccccc3cc2[nH]1
Show InChI InChI=1S/C18H17F3N2O/c19-18(20,21)16(24)8-2-1-3-9-17-22-14-10-12-6-4-5-7-13(12)11-15(14)23-17/h4-7,10-11H,1-3,8-9H2,(H,22,23)
1.40E+3n/an/an/an/an/an/an/an/a
University of G£ttingen
Curated by ChEMBL
Assay Description
Displacement of Atto700-HA from Bordetella/Alcaligenes strain FB188 HDAH by fluorescence anisotropy
Bioorg Med Chem Lett 19: 3651-6 (2009)
Article DOI: 10.1016/j.bmcl.2009.04.102
BindingDB Entry DOI: 10.7270/Q24T6JFV
Histone deacetylase-like amidohydrolase
(Alcaligenes sp. (strain DSM 11172) (Bordetella sp....)
BDBM50293704
(1,1,1-trifluoro-7-(1H-naphtho[2,3-d]imidazol-2-yl)...)
Show SMILES FC(F)(F)C(=O)CCCCCc1nc2cc3ccccc3cc2[nH]1
Show InChI InChI=1S/C18H17F3N2O/c19-18(20,21)16(24)8-2-1-3-9-17-22-14-10-12-6-4-5-7-13(12)11-15(14)23-17/h4-7,10-11H,1-3,8-9H2,(H,22,23)
n/an/a 600n/an/an/an/an/an/a
University of G£ttingen
Curated by ChEMBL
Assay Description
Inhibition of Bordetella/Alcaligenes strain FB188 HDAH by fluorogenic enzyme assay
Bioorg Med Chem Lett 19: 3651-6 (2009)
Article DOI: 10.1016/j.bmcl.2009.04.102
BindingDB Entry DOI: 10.7270/Q24T6JFV