null
SMILES: Clc1ccc(NC(=O)c2ccccc2)cc1Cl
InChI Key: InChIKey=JMMLZWNYIVVPOH-UHFFFAOYSA-N
Activity Spreadsheet -- Enzyme Inhibition Constant Data from BindingDB
Found 1 hit for monomerid = 50293731
Trg + Lig
Ki
nM
ΔG°
kcal/mole
IC50
nM
Kd
nM
EC50/IC50
nM
koff
s-1
kon
M-1s-1
pHTemp
°C
Metabotropic glutamate receptor 4
(Homo sapiens (Human))
BDBM50293731
(CHEMBL560296 | N-(3,4-dichlorophenyl)benzamide)
Show SMILES Clc1ccc(NC(=O)c2ccccc2)cc1Cl
Show InChI InChI=1S/C13H9Cl2NO/c14-11-7-6-10(8-12(11)15)16-13(17)9-4-2-1-3-5-9/h1-8H,(H,16,17)
n/an/an/an/a>1.00E+4n/an/an/an/a
Vanderbilt University Medical Center
Curated by ChEMBL
Assay Description
Activity at human mGluR4 receptor expressed in CHO cells assessed as effect on calcium mobilization
J Med Chem 52: 4115-8 (2009)
Article DOI: 10.1021/jm9005065
BindingDB Entry DOI: 10.7270/Q2RJ4JHT