BDBM50293819 ((2R,3S,4R,5R)-3,4-dihydroxy-5-(6-oxo-1,6,7,8-tetrahydropurin-9-yl)-tetrahydrofuran-2-yl)methyl phosphate::CHEMBL541690
SMILES: O[C@@H]1[C@@H](COP(O)(O)=O)O[C@H]([C@@H]1O)N1CNc2c1nc[nH]c2=O
InChI Key: InChIKey=JTAKDJLNMDBJEP-KQYNXXCUSA-N
Data: 1 KI
Activity Spreadsheet -- Enzyme Inhibition Constant Data from BindingDB
Found 1 hit for monomerid = 50293819
Trg + Lig
Ki
nM
ΔG°
kcal/mole
IC50
nM
Kd
nM
EC50/IC50
nM
koff
s-1
kon
M-1s-1
pHTemp
°C
Hypoxanthine-guanine phosphoribosyltransferase
(Homo sapiens (Human))
BDBM50293819
(((2R,3S,4R,5R)-3,4-dihydroxy-5-(6-oxo-1,6,7,8-tetr...)
Show SMILES O[C@@H]1[C@@H](COP(O)(O)=O)O[C@H]([C@@H]1O)N1CNc2c1nc[nH]c2=O |r|
Show InChI InChI=1S/C10H15N4O8P/c15-6-4(1-21-23(18,19)20)22-10(7(6)16)14-3-13-5-8(14)11-2-12-9(5)17/h2,4,6-7,10,13,15-16H,1,3H2,(H,11,12,17)(H2,18,19,20)/t4-,6-,7-,10-/m1/s1
Reactome pathway
5.40E+3n/an/an/an/an/an/a7.4n/a
The University of Queensland
Curated by ChEMBL
Assay Description
Inhibition of human recombinant HGPRT at pH 7.4 by spectrophotometric assay
J Med Chem 52: 4391-9 (2009)
Article DOI: 10.1021/jm900267n
BindingDB Entry DOI: 10.7270/Q27M0809
3D
3D Structure (docked)