BDBM50293837 (S)-9-[3-hydroxy-2-(phosphonomethoxy)propyl]guanine::CHEMBL563683
SMILES: Nc1nc2N(C[C@@H](CO)OCP(O)(O)=O)CNc2c(=O)[nH]1
InChI Key: InChIKey=SPLAHEWQICOEBR-YFKPBYRVSA-N
Data: 1 KI
Activity Spreadsheet -- Enzyme Inhibition Constant Data from BindingDB
Found 1 hit for monomerid = 50293837
Trg + Lig
Ki
nM
ΔG°
kcal/mole
IC50
nM
Kd
nM
EC50/IC50
nM
koff
s-1
kon
M-1s-1
pHTemp
°C
Hypoxanthine-guanine phosphoribosyltransferase
(Homo sapiens (Human))
BDBM50293837
((S)-9-[3-hydroxy-2-(phosphonomethoxy)propyl]guanin...)
Show SMILES Nc1nc2N(C[C@@H](CO)OCP(O)(O)=O)CNc2c(=O)[nH]1 |r|
Show InChI InChI=1S/C9H16N5O6P/c10-9-12-7-6(8(16)13-9)11-3-14(7)1-5(2-15)20-4-21(17,18)19/h5,11,15H,1-4H2,(H2,17,18,19)(H3,10,12,13,16)/t5-/m0/s1
Reactome pathway
1.77E+5n/an/an/an/an/an/a8.5n/a
The University of Queensland
Curated by ChEMBL
Assay Description
Inhibition of human recombinant HGPRT at pH 8.5 by spectrophotometric assay
J Med Chem 52: 4391-9 (2009)
Article DOI: 10.1021/jm900267n
BindingDB Entry DOI: 10.7270/Q27M0809
3D
3D Structure (docked)