BDBM50293952 5-Chloro-3-(4-methoxy-2,5-dimethylphenylamino)-1-(1-propylbutyl)pyrazin-2(1H)-one::CHEMBL560350
SMILES: CCCC(CCC)n1cc(Cl)nc(Nc2cc(C)c(OC)cc2C)c1=O
InChI Key: InChIKey=PCARLPUTXSVWJY-UHFFFAOYSA-N
Data: 1 IC50
Activity Spreadsheet -- Enzyme Inhibition Constant Data from BindingDB
Found 1 hit for monomerid = 50293952
Trg + Lig
Ki
nM
ΔG°
kcal/mole
IC50
nM
Kd
nM
EC50/IC50
nM
koff
s-1
kon
M-1s-1
pHTemp
°C
Corticotropin releasing factor receptor
(Rattus norvegicus (rat))
BDBM50293952
(5-Chloro-3-(4-methoxy-2,5-dimethylphenylamino)-1-(...)
Show SMILES CCCC(CCC)n1cc(Cl)nc(Nc2cc(C)c(OC)cc2C)c1=O
Show InChI InChI=1S/C20H28ClN3O2/c1-6-8-15(9-7-2)24-12-18(21)23-19(20(24)25)22-16-10-14(4)17(26-5)11-13(16)3/h10-12,15H,6-9H2,1-5H3,(H,22,23)
Reactome pathway
n/an/a 0.620n/an/an/an/an/an/a
Bristol-Myers Squibb Company
Curated by ChEMBL
Assay Description
Displacement of [125I]Tyr-ovine-CRF from CRF1 receptor in rat frontal cortex homogenate by gamma counting
J Med Chem 52: 4173-91 (2009)
Article DOI: 10.1021/jm900301y
BindingDB Entry DOI: 10.7270/Q2G44Q9K