BDBM50294102 CHEMBL553638::N1-[3'-Aminopropyl)-3-aminopropyl]-N3-(gamma,gamma-dimethylallyl)-guanidine bis(trifluoroacetate)
SMILES: [#6]\[#6](-[#6])=[#6]\[#6]-[#7]-[#6](-[#7])=[#7]-[#6]-[#6]-[#6]-[#7]-[#6]-[#6]-[#6]-[#7]
InChI Key: InChIKey=GMFVMHAXKJJQKE-UHFFFAOYSA-N
Data: 1 KI
Activity Spreadsheet -- Enzyme Inhibition Constant Data from BindingDB
Found 1 hit for monomerid = 50294102
Trg + Lig
Ki
nM
ΔG°
kcal/mole
IC50
nM
Kd
nM
EC50/IC50
nM
koff
s-1
kon
M-1s-1
pHTemp
°C
Polyamine oxidase
(Zea mays)
BDBM50294102
(CHEMBL553638 | N1-[3'-Aminopropyl)-3-aminopropyl]-...)
Show SMILES [#6]\[#6](-[#6])=[#6]\[#6]-[#7]-[#6](-[#7])=[#7]-[#6]-[#6]-[#6]-[#7]-[#6]-[#6]-[#6]-[#7] |w:8.8|
Show InChI InChI=1S/C12H27N5/c1-11(2)5-10-17-12(14)16-9-4-8-15-7-3-6-13/h5,15H,3-4,6-10,13H2,1-2H3,(H3,14,16,17)
1.21E+3n/an/an/an/an/an/a6.5n/a
Universit£ degli Studi di Siena
Curated by ChEMBL
Assay Description
Inhibition of maize PAO at pH 6.5 by spectrophotometry-based Dixon plot method
J Med Chem 52: 4774-85 (2009)
Article DOI: 10.1021/jm900371z
BindingDB Entry DOI: 10.7270/Q2TB16W1