BDBM50294122 CHEMBL560837::N-Hydroxy-2-(N-isopropoxy-4'-methoxybiphenyl-4-ylsulfonamido)acetamide
SMILES: COc1ccc(cc1)-c1ccc(cc1)S(=O)(=O)N(CC(=O)NO)OC(C)C
InChI Key: InChIKey=LBKCSOUMADYGHM-UHFFFAOYSA-N
Data: 1 KI  8 IC50
Activity Spreadsheet -- Enzyme Inhibition Constant Data from BindingDB
Found 9 hits for monomerid = 50294122
Trg + Lig
Ki
nM
ΔG°
kcal/mole
IC50
nM
Kd
nM
EC50/IC50
nM
koff
s-1
kon
M-1s-1
pHTemp
°C
72 kDa type IV collagenase
(Homo sapiens (Human))
BDBM50294122
(CHEMBL560837 | N-Hydroxy-2-(N-isopropoxy-4'-methox...)
Show SMILES COc1ccc(cc1)-c1ccc(cc1)S(=O)(=O)N(CC(=O)NO)OC(C)C
Show InChI InChI=1S/C18H22N2O6S/c1-13(2)26-20(12-18(21)19-22)27(23,24)17-10-6-15(7-11-17)14-4-8-16(25-3)9-5-14/h4-11,13,22H,12H2,1-3H3,(H,19,21)
Reactome pathway
3.80n/an/an/an/an/an/an/an/a
Universit£ di Pisa
Curated by ChEMBL
Assay Description
Inhibition of MMP2
J Med Chem 52: 4757-73 (2009)
Article DOI: 10.1021/jm900261f
BindingDB Entry DOI: 10.7270/Q2JW8DXN
Matrix metalloproteinase-9
(Homo sapiens (Human))
BDBM50294122
(CHEMBL560837 | N-Hydroxy-2-(N-isopropoxy-4'-methox...)
Show SMILES COc1ccc(cc1)-c1ccc(cc1)S(=O)(=O)N(CC(=O)NO)OC(C)C
Show InChI InChI=1S/C18H22N2O6S/c1-13(2)26-20(12-18(21)19-22)27(23,24)17-10-6-15(7-11-17)14-4-8-16(25-3)9-5-14/h4-11,13,22H,12H2,1-3H3,(H,19,21)
Reactome pathway
n/an/a 160n/an/an/an/an/an/a
Universit£ di Pisa
Curated by ChEMBL
Assay Description
Inhibition of MMP9
J Med Chem 52: 4757-73 (2009)
Article DOI: 10.1021/jm900261f
BindingDB Entry DOI: 10.7270/Q2JW8DXN
72 kDa type IV collagenase
(Homo sapiens (Human))
BDBM50294122
(CHEMBL560837 | N-Hydroxy-2-(N-isopropoxy-4'-methox...)
Show SMILES COc1ccc(cc1)-c1ccc(cc1)S(=O)(=O)N(CC(=O)NO)OC(C)C
Show InChI InChI=1S/C18H22N2O6S/c1-13(2)26-20(12-18(21)19-22)27(23,24)17-10-6-15(7-11-17)14-4-8-16(25-3)9-5-14/h4-11,13,22H,12H2,1-3H3,(H,19,21)
Reactome pathway
n/an/a 4.20n/an/an/an/an/an/a
Universit£ di Pisa
Curated by ChEMBL
Assay Description
Inhibition of MMP2
J Med Chem 52: 4757-73 (2009)
Article DOI: 10.1021/jm900261f
BindingDB Entry DOI: 10.7270/Q2JW8DXN
Matrix metalloproteinase-14 (MMP14)
(Homo sapiens (Human))
BDBM50294122
(CHEMBL560837 | N-Hydroxy-2-(N-isopropoxy-4'-methox...)
Show SMILES COc1ccc(cc1)-c1ccc(cc1)S(=O)(=O)N(CC(=O)NO)OC(C)C
Show InChI InChI=1S/C18H22N2O6S/c1-13(2)26-20(12-18(21)19-22)27(23,24)17-10-6-15(7-11-17)14-4-8-16(25-3)9-5-14/h4-11,13,22H,12H2,1-3H3,(H,19,21)
n/an/a 1.00E+3n/an/an/an/an/an/a
Universit£ di Pisa
Curated by ChEMBL
Assay Description
Inhibition of human recombinant MMP14
J Med Chem 52: 4757-73 (2009)
Article DOI: 10.1021/jm900261f
BindingDB Entry DOI: 10.7270/Q2JW8DXN
Stromelysin-1
(Homo sapiens (Human))
BDBM50294122
(CHEMBL560837 | N-Hydroxy-2-(N-isopropoxy-4'-methox...)
Show SMILES COc1ccc(cc1)-c1ccc(cc1)S(=O)(=O)N(CC(=O)NO)OC(C)C
Show InChI InChI=1S/C18H22N2O6S/c1-13(2)26-20(12-18(21)19-22)27(23,24)17-10-6-15(7-11-17)14-4-8-16(25-3)9-5-14/h4-11,13,22H,12H2,1-3H3,(H,19,21)
Reactome pathway
n/an/a 1.80E+3n/an/an/an/an/an/a
Universit£ di Pisa
Curated by ChEMBL
Assay Description
Inhibition of MMP3
J Med Chem 52: 4757-73 (2009)
Article DOI: 10.1021/jm900261f
BindingDB Entry DOI: 10.7270/Q2JW8DXN
Neutrophil collagenase
(Homo sapiens (Human))
BDBM50294122
(CHEMBL560837 | N-Hydroxy-2-(N-isopropoxy-4'-methox...)
Show SMILES COc1ccc(cc1)-c1ccc(cc1)S(=O)(=O)N(CC(=O)NO)OC(C)C
Show InChI InChI=1S/C18H22N2O6S/c1-13(2)26-20(12-18(21)19-22)27(23,24)17-10-6-15(7-11-17)14-4-8-16(25-3)9-5-14/h4-11,13,22H,12H2,1-3H3,(H,19,21)
Reactome pathway
n/an/a 65n/an/an/an/an/an/a
Universit£ di Pisa
Curated by ChEMBL
Assay Description
Inhibition of MMP8
J Med Chem 52: 4757-73 (2009)
Article DOI: 10.1021/jm900261f
BindingDB Entry DOI: 10.7270/Q2JW8DXN
Collagenase 3
(Homo sapiens (Human))
BDBM50294122
(CHEMBL560837 | N-Hydroxy-2-(N-isopropoxy-4'-methox...)
Show SMILES COc1ccc(cc1)-c1ccc(cc1)S(=O)(=O)N(CC(=O)NO)OC(C)C
Show InChI InChI=1S/C18H22N2O6S/c1-13(2)26-20(12-18(21)19-22)27(23,24)17-10-6-15(7-11-17)14-4-8-16(25-3)9-5-14/h4-11,13,22H,12H2,1-3H3,(H,19,21)
NCI pathway
Reactome pathway
n/an/a 10n/an/an/an/an/an/a
Universit£ di Pisa
Curated by ChEMBL
Assay Description
Inhibition of MMP13-mediated collagen degradation by SDS-PAGE
J Med Chem 52: 4757-73 (2009)
Article DOI: 10.1021/jm900261f
BindingDB Entry DOI: 10.7270/Q2JW8DXN
Collagenase 3
(Homo sapiens (Human))
BDBM50294122
(CHEMBL560837 | N-Hydroxy-2-(N-isopropoxy-4'-methox...)
Show SMILES COc1ccc(cc1)-c1ccc(cc1)S(=O)(=O)N(CC(=O)NO)OC(C)C
Show InChI InChI=1S/C18H22N2O6S/c1-13(2)26-20(12-18(21)19-22)27(23,24)17-10-6-15(7-11-17)14-4-8-16(25-3)9-5-14/h4-11,13,22H,12H2,1-3H3,(H,19,21)
NCI pathway
Reactome pathway
n/an/a 10n/an/an/an/an/an/a
Universit£ di Pisa
Curated by ChEMBL
Assay Description
Inhibition of MMP13
J Med Chem 52: 4757-73 (2009)
Article DOI: 10.1021/jm900261f
BindingDB Entry DOI: 10.7270/Q2JW8DXN
Interstitial collagenase
(Homo sapiens (Human))
BDBM50294122
(CHEMBL560837 | N-Hydroxy-2-(N-isopropoxy-4'-methox...)
Show SMILES COc1ccc(cc1)-c1ccc(cc1)S(=O)(=O)N(CC(=O)NO)OC(C)C
Show InChI InChI=1S/C18H22N2O6S/c1-13(2)26-20(12-18(21)19-22)27(23,24)17-10-6-15(7-11-17)14-4-8-16(25-3)9-5-14/h4-11,13,22H,12H2,1-3H3,(H,19,21)
Reactome pathway
n/an/a 1.30E+4n/an/an/an/an/an/a
Universit£ di Pisa
Curated by ChEMBL
Assay Description
Inhibition of MMP1
J Med Chem 52: 4757-73 (2009)
Article DOI: 10.1021/jm900261f
BindingDB Entry DOI: 10.7270/Q2JW8DXN