BDBM50294199 2-(6-(benzofuran-6-yl)-2,2-dimethyl-7-phenyl-2,3-dihydro-1H-pyrrolizin-5-yl)acetic acid::CHEMBL561824
SMILES: CC1(C)Cc2c(c(c(CC(O)=O)n2C1)-c1ccc2ccoc2c1)-c1ccccc1
InChI Key: InChIKey=IGCDNRCKJRMTAZ-UHFFFAOYSA-N
Data: 1 IC50
Activity Spreadsheet -- Enzyme Inhibition Constant Data from BindingDB
Found 1 hit for monomerid = 50294199
Trg + Lig
Ki
nM
ΔG°
kcal/mole
IC50
nM
Kd
nM
EC50/IC50
nM
koff
s-1
kon
M-1s-1
pHTemp
°C
Prostaglandin E synthase
(Homo sapiens (Human))
BDBM50294199
(2-(6-(benzofuran-6-yl)-2,2-dimethyl-7-phenyl-2,3-d...)
Show SMILES CC1(C)Cc2c(c(c(CC(O)=O)n2C1)-c1ccc2ccoc2c1)-c1ccccc1
Show InChI InChI=1S/C25H23NO3/c1-25(2)14-20-23(17-6-4-3-5-7-17)24(19(13-22(27)28)26(20)15-25)18-9-8-16-10-11-29-21(16)12-18/h3-12H,13-15H2,1-2H3,(H,27,28)
Reactome pathway
n/an/a 6.20E+3n/an/an/an/an/an/a
Eberhard Karls University Tuebingen
Curated by ChEMBL
Assay Description
Inhibition of mPGES1 in IL-1beta treated human A549 cell microsomal membrane assessed as residual enzyme activity after 1 min by measuring PGE2 level...
J Med Chem 52: 4968-72 (2009)
Article DOI: 10.1021/jm900481c
BindingDB Entry DOI: 10.7270/Q29C6XGX