BDBM50294486 2-amino-4-(((2S,3S,4R,5R)-5-(6-amino-2-chloro-9H-purin-9-yl)-3,4-dihydroxy-tetrahydrofuran-2-yl)methylthio)butanoic acid::CHEMBL564768
SMILES: NC(CCSC[C@H]1O[C@H]([C@H](O)[C@@H]1O)n1cnc2c(N)nc(Cl)nc12)C(O)=O
InChI Key: InChIKey=HGUVDAILKKOLIO-NRJACJQQSA-N
Data: 2 IC50
Activity Spreadsheet -- Enzyme Inhibition Constant Data from BindingDB
Found 2 hits for monomerid = 50294486
Trg + Lig
Ki
nM
ΔG°
kcal/mole
IC50
nM
Kd
nM
EC50/IC50
nM
koff
s-1
kon
M-1s-1
pHTemp
°C
DNA (cytosine-5)-methyltransferase 3B
(Homo sapiens (Human))
BDBM50294486
(2-amino-4-(((2S,3S,4R,5R)-5-(6-amino-2-chloro-9H-p...)
Show SMILES NC(CCSC[C@H]1O[C@H]([C@H](O)[C@@H]1O)n1cnc2c(N)nc(Cl)nc12)C(O)=O |r|
Show InChI InChI=1S/C14H19ClN6O5S/c15-14-19-10(17)7-11(20-14)21(4-18-7)12-9(23)8(22)6(26-12)3-27-2-1-5(16)13(24)25/h4-6,8-9,12,22-23H,1-3,16H2,(H,24,25)(H2,17,19,20)/t5?,6-,8-,9-,12-/m1/s1
Reactome pathway
n/an/a 5.72E+4n/an/an/an/an/an/a
MethylGene Inc.
Curated by ChEMBL
Assay Description
Inhibition of human recombinant DNMT3b2 expressed in baculovirus infected high five insect cells
Bioorg Med Chem Lett 19: 2747-51 (2009)
Article DOI: 10.1016/j.bmcl.2009.03.113
BindingDB Entry DOI: 10.7270/Q2W37WC2
DNA (cytosine-5)-methyltransferase 1 (DNMT1)
(Homo sapiens (Human))
BDBM50294486
(2-amino-4-(((2S,3S,4R,5R)-5-(6-amino-2-chloro-9H-p...)
Show SMILES NC(CCSC[C@H]1O[C@H]([C@H](O)[C@@H]1O)n1cnc2c(N)nc(Cl)nc12)C(O)=O |r|
Show InChI InChI=1S/C14H19ClN6O5S/c15-14-19-10(17)7-11(20-14)21(4-18-7)12-9(23)8(22)6(26-12)3-27-2-1-5(16)13(24)25/h4-6,8-9,12,22-23H,1-3,16H2,(H,24,25)(H2,17,19,20)/t5?,6-,8-,9-,12-/m1/s1
n/an/a 2.90E+3n/an/an/an/an/an/a
MethylGene Inc.
Curated by ChEMBL
Assay Description
Inhibition of human recombinant DNMT1 expressed in baculovirus infected high five insect cells
Bioorg Med Chem Lett 19: 2747-51 (2009)
Article DOI: 10.1016/j.bmcl.2009.03.113
BindingDB Entry DOI: 10.7270/Q2W37WC2