null
SMILES: [#6]-[#8]-c1ccc(-[#6]-n2c(=O)nc(-[#7]-[#6]-[#6]\[#7]=[#6](\[#7])-[#7])n(-[#6]-c3ccc(-[#8])cc3)c2=O)cc1
InChI Key: InChIKey=YWLKCUGXUBOTNS-UHFFFAOYSA-N
Activity Spreadsheet -- Enzyme Inhibition Constant Data from BindingDB
Found 1 hit for monomerid = 50294601
Trg + Lig
Ki
nM
ΔG°
kcal/mole
IC50
nM
Kd
nM
EC50/IC50
nM
koff
s-1
kon
M-1s-1
pHTemp
°C
Prokineticin receptor 1
(Homo sapiens (Human))
BDBM50294601
(1-(2-(1-(4-hydroxybenzyl)-5-(4-methoxybenzyl)-4,6-...)
Show SMILES [#6]-[#8]-c1ccc(-[#6]-n2c(=O)nc(-[#7]-[#6]-[#6]\[#7]=[#6](\[#7])-[#7])n(-[#6]-c3ccc(-[#8])cc3)c2=O)cc1
Show InChI InChI=1S/C21H25N7O4/c1-32-17-8-4-15(5-9-17)13-28-20(30)26-19(25-11-10-24-18(22)23)27(21(28)31)12-14-2-6-16(29)7-3-14/h2-9,29H,10-13H2,1H3,(H4,22,23,24)(H,25,26,30)
NCI pathway
Reactome pathway
n/an/a 27n/an/an/an/an/an/a
Johnson& Johnson Pharmaceutical Research and Development
Curated by ChEMBL
Assay Description
Antagonist activity at human PKR1 expressed in HEK293 cells assessed as inhibition of PK1-induced calcium mobilization by FLIPR assay
Bioorg Med Chem Lett 19: 2661-3 (2009)
Article DOI: 10.1016/j.bmcl.2009.03.157
BindingDB Entry DOI: 10.7270/Q23N23DG