BDBM50295062 2-(4-{[(2S)-8-Methyl-2,3-dihydro[1,4]dioxino[2,3-f]quinolin-2-yl]methyl}piperazin-1-yl)quino-line-6-carboxamide::CHEMBL559778
SMILES: Cc1ccc2c3O[C@@H](CN4CCN(CC4)c4ccc5cc(ccc5n4)C(N)=O)COc3ccc2n1
InChI Key: InChIKey=XLBQSSZFTNCULY-FQEVSTJZSA-N
Data: 2 KI  1 IC50
Activity Spreadsheet -- Enzyme Inhibition Constant Data from BindingDB
Found 3 hits for monomerid = 50295062
Trg + Lig
Ki
nM
ΔG°
kcal/mole
IC50
nM
Kd
nM
EC50/IC50
nM
koff
s-1
kon
M-1s-1
pHTemp
°C
5-hydroxytryptamine receptor 1A
(Homo sapiens (Human))
BDBM50295062
(2-(4-{[(2S)-8-Methyl-2,3-dihydro[1,4]dioxino[2,3-f...)
Show SMILES Cc1ccc2c3O[C@@H](CN4CCN(CC4)c4ccc5cc(ccc5n4)C(N)=O)COc3ccc2n1 |r|
Show InChI InChI=1S/C27H27N5O3/c1-17-2-5-21-23(29-17)7-8-24-26(21)35-20(16-34-24)15-31-10-12-32(13-11-31)25-9-4-18-14-19(27(28)33)3-6-22(18)30-25/h2-9,14,20H,10-13,15-16H2,1H3,(H2,28,33)/t20-/m0/s1
7.20n/an/an/an/an/an/an/an/a
Wyeth Research
Curated by ChEMBL
Assay Description
Displacement of [3H]8-OH-DPAT from human 5HT1A receptor expressed in CHO cells
J Med Chem 52: 4955-9 (2009)
Article DOI: 10.1021/jm900374r
BindingDB Entry DOI: 10.7270/Q2CZ376D
Sodium-dependent serotonin transporter
(Rattus norvegicus (rat))
BDBM50295062
(2-(4-{[(2S)-8-Methyl-2,3-dihydro[1,4]dioxino[2,3-f...)
Show SMILES Cc1ccc2c3O[C@@H](CN4CCN(CC4)c4ccc5cc(ccc5n4)C(N)=O)COc3ccc2n1 |r|
Show InChI InChI=1S/C27H27N5O3/c1-17-2-5-21-23(29-17)7-8-24-26(21)35-20(16-34-24)15-31-10-12-32(13-11-31)25-9-4-18-14-19(27(28)33)3-6-22(18)30-25/h2-9,14,20H,10-13,15-16H2,1H3,(H2,28,33)/t20-/m0/s1
17n/an/an/an/an/an/an/an/a
Wyeth Research
Curated by ChEMBL
Assay Description
Displacement of [3H]paroxetine from 5HT transporter in rat cortical membrane
J Med Chem 52: 4955-9 (2009)
Article DOI: 10.1021/jm900374r
BindingDB Entry DOI: 10.7270/Q2CZ376D
5-hydroxytryptamine receptor 1A
(Homo sapiens (Human))
BDBM50295062
(2-(4-{[(2S)-8-Methyl-2,3-dihydro[1,4]dioxino[2,3-f...)
Show SMILES Cc1ccc2c3O[C@@H](CN4CCN(CC4)c4ccc5cc(ccc5n4)C(N)=O)COc3ccc2n1 |r|
Show InChI InChI=1S/C27H27N5O3/c1-17-2-5-21-23(29-17)7-8-24-26(21)35-20(16-34-24)15-31-10-12-32(13-11-31)25-9-4-18-14-19(27(28)33)3-6-22(18)30-25/h2-9,14,20H,10-13,15-16H2,1H3,(H2,28,33)/t20-/m0/s1
n/an/a 164n/an/an/an/an/an/a
Wyeth Research
Curated by ChEMBL
Assay Description
Antagonist activity at human 5HT1A receptor expressed in CHO cells assessed as stimulation of [35S]GTPgammaS binding
J Med Chem 52: 4955-9 (2009)
Article DOI: 10.1021/jm900374r
BindingDB Entry DOI: 10.7270/Q2CZ376D