BDBM50295215 CHEMBL550382::N-((1-methylpyrrolidin-3-yl)methyl)-5-oxo-4,5-dihydropyrazolo[1,5-a]quinazoline-2-carboxamide
SMILES: CN1CCC(CNC(=O)c2cc3[nH]c(=O)c4ccccc4n3n2)C1
InChI Key: InChIKey=AQCJBKVEOQRKOD-UHFFFAOYSA-N
Data: 1 IC50
Activity Spreadsheet -- Enzyme Inhibition Constant Data from BindingDB
Found 1 hit for monomerid = 50295215
Trg + Lig
Ki
nM
ΔG°
kcal/mole
IC50
nM
Kd
nM
EC50/IC50
nM
koff
s-1
kon
M-1s-1
pHTemp
°C
Poly [ADP-ribose] polymerase 1
(Homo sapiens (Human))
BDBM50295215
(CHEMBL550382 | N-((1-methylpyrrolidin-3-yl)methyl)...)
Show SMILES CN1CCC(CNC(=O)c2cc3[nH]c(=O)c4ccccc4n3n2)C1
Show InChI InChI=1S/C17H19N5O2/c1-21-7-6-11(10-21)9-18-17(24)13-8-15-19-16(23)12-4-2-3-5-14(12)22(15)20-13/h2-5,8,11H,6-7,9-10H2,1H3,(H,18,24)(H,19,23)
n/an/a 80n/an/an/an/an/an/a
IRBM - Merck Research Laboratories Rome
Curated by ChEMBL
Assay Description
Inhibition of PARP1 by scintillation proximity assay
Bioorg Med Chem Lett 19: 4196-200 (2009)
Article DOI: 10.1016/j.bmcl.2009.05.113
BindingDB Entry DOI: 10.7270/Q2MG7PHP