BDBM50295506 (S)-3-Methyl-2-(7-(3-(2-(thiophen-2-yl)ethyl)ureido)dibenzo-[b,d]furan-3-sulfonamido)butanoic Acid::CHEMBL552362
SMILES: CC(C)[C@H](NS(=O)(=O)c1ccc2c(c1)oc1cc(NC(=O)NCCc3cccs3)ccc21)C(O)=O
InChI Key: InChIKey=FFGHBWJVBSUBKN-QFIPXVFZSA-N
Data: 2 IC50
Activity Spreadsheet -- Enzyme Inhibition Constant Data from BindingDB
Found 2 hits for monomerid = 50295506
Trg + Lig
Ki
nM
ΔG°
kcal/mole
IC50
nM
Kd
nM
EC50/IC50
nM
koff
s-1
kon
M-1s-1
pHTemp
°C
Collagenase 3
(Homo sapiens (Human))
BDBM50295506
((S)-3-Methyl-2-(7-(3-(2-(thiophen-2-yl)ethyl)ureid...)
Show SMILES CC(C)[C@H](NS(=O)(=O)c1ccc2c(c1)oc1cc(NC(=O)NCCc3cccs3)ccc21)C(O)=O |r|
Show InChI InChI=1S/C24H25N3O6S2/c1-14(2)22(23(28)29)27-35(31,32)17-6-8-19-18-7-5-15(12-20(18)33-21(19)13-17)26-24(30)25-10-9-16-4-3-11-34-16/h3-8,11-14,22,27H,9-10H2,1-2H3,(H,28,29)(H2,25,26,30)/t22-/m0/s1
NCI pathway
Reactome pathway
n/an/a 187n/an/an/an/an/an/a
Wyeth Research
Curated by ChEMBL
Assay Description
Inhibition of human recombinant MMP13
J Med Chem 52: 5408-19 (2009)
Article DOI: 10.1021/jm900809r
BindingDB Entry DOI: 10.7270/Q21J99SW
Matrix metalloproteinase-12 (MMP12)
(Homo sapiens (Human))
BDBM50295506
((S)-3-Methyl-2-(7-(3-(2-(thiophen-2-yl)ethyl)ureid...)
Show SMILES CC(C)[C@H](NS(=O)(=O)c1ccc2c(c1)oc1cc(NC(=O)NCCc3cccs3)ccc21)C(O)=O |r|
Show InChI InChI=1S/C24H25N3O6S2/c1-14(2)22(23(28)29)27-35(31,32)17-6-8-19-18-7-5-15(12-20(18)33-21(19)13-17)26-24(30)25-10-9-16-4-3-11-34-16/h3-8,11-14,22,27H,9-10H2,1-2H3,(H,28,29)(H2,25,26,30)/t22-/m0/s1
Reactome pathway
n/an/a 18n/an/an/an/an/an/a
Wyeth Research
Curated by ChEMBL
Assay Description
Inhibition of human recombinant MMP12
J Med Chem 52: 5408-19 (2009)
Article DOI: 10.1021/jm900809r
BindingDB Entry DOI: 10.7270/Q21J99SW