BDBM50295507 (R)-3-Methyl-2-(7-(3-phenylureido)dibenzo[b,d]thiophene-3-sulfonamido)butanoic Acid::CHEMBL550786
SMILES: CC(C)[C@@H](NS(=O)(=O)c1ccc2c(c1)sc1cc(NC(=O)Nc3ccccc3)ccc21)C(O)=O
InChI Key: InChIKey=CCTDBXLXFNHDIL-JOCHJYFZSA-N
Data: 2 IC50
Activity Spreadsheet -- Enzyme Inhibition Constant Data from BindingDB
Found 2 hits for monomerid = 50295507
Trg + Lig
Ki
nM
ΔG°
kcal/mole
IC50
nM
Kd
nM
EC50/IC50
nM
koff
s-1
kon
M-1s-1
pHTemp
°C
Collagenase 3
(Homo sapiens (Human))
BDBM50295507
((R)-3-Methyl-2-(7-(3-phenylureido)dibenzo[b,d]thio...)
Show SMILES CC(C)[C@@H](NS(=O)(=O)c1ccc2c(c1)sc1cc(NC(=O)Nc3ccccc3)ccc21)C(O)=O |r|
Show InChI InChI=1S/C24H23N3O5S2/c1-14(2)22(23(28)29)27-34(31,32)17-9-11-19-18-10-8-16(12-20(18)33-21(19)13-17)26-24(30)25-15-6-4-3-5-7-15/h3-14,22,27H,1-2H3,(H,28,29)(H2,25,26,30)/t22-/m1/s1
NCI pathway
Reactome pathway
n/an/a 1.29E+3n/an/an/an/an/an/a
Wyeth Research
Curated by ChEMBL
Assay Description
Inhibition of human recombinant MMP13
J Med Chem 52: 5408-19 (2009)
Article DOI: 10.1021/jm900809r
BindingDB Entry DOI: 10.7270/Q21J99SW
Matrix metalloproteinase-12 (MMP12)
(Homo sapiens (Human))
BDBM50295507
((R)-3-Methyl-2-(7-(3-phenylureido)dibenzo[b,d]thio...)
Show SMILES CC(C)[C@@H](NS(=O)(=O)c1ccc2c(c1)sc1cc(NC(=O)Nc3ccccc3)ccc21)C(O)=O |r|
Show InChI InChI=1S/C24H23N3O5S2/c1-14(2)22(23(28)29)27-34(31,32)17-9-11-19-18-10-8-16(12-20(18)33-21(19)13-17)26-24(30)25-15-6-4-3-5-7-15/h3-14,22,27H,1-2H3,(H,28,29)(H2,25,26,30)/t22-/m1/s1
Reactome pathway
n/an/a 1.47E+3n/an/an/an/an/an/a
Wyeth Research
Curated by ChEMBL
Assay Description
Inhibition of human recombinant MMP12
J Med Chem 52: 5408-19 (2009)
Article DOI: 10.1021/jm900809r
BindingDB Entry DOI: 10.7270/Q21J99SW