BDBM50295509 (S)-2-(7-(3-Benzylureido)dibenzo[b,d]thiophene-3-sulfonamido)-3-methylbutanoic Acid::CHEMBL563343
SMILES: CC(C)[C@H](NS(=O)(=O)c1ccc2c(c1)sc1cc(NC(=O)NCc3ccccc3)ccc21)C(O)=O
InChI Key: InChIKey=TUJKFLFRSWBCFZ-QHCPKHFHSA-N
Data: 2 IC50
Activity Spreadsheet -- Enzyme Inhibition Constant Data from BindingDB
Found 2 hits for monomerid = 50295509
Trg + Lig
Ki
nM
ΔG°
kcal/mole
IC50
nM
Kd
nM
EC50/IC50
nM
koff
s-1
kon
M-1s-1
pHTemp
°C
Collagenase 3
(Homo sapiens (Human))
BDBM50295509
((S)-2-(7-(3-Benzylureido)dibenzo[b,d]thiophene-3-s...)
Show SMILES CC(C)[C@H](NS(=O)(=O)c1ccc2c(c1)sc1cc(NC(=O)NCc3ccccc3)ccc21)C(O)=O |r|
Show InChI InChI=1S/C25H25N3O5S2/c1-15(2)23(24(29)30)28-35(32,33)18-9-11-20-19-10-8-17(12-21(19)34-22(20)13-18)27-25(31)26-14-16-6-4-3-5-7-16/h3-13,15,23,28H,14H2,1-2H3,(H,29,30)(H2,26,27,31)/t23-/m0/s1
NCI pathway
Reactome pathway
n/an/a 200n/an/an/an/an/an/a
Wyeth Research
Curated by ChEMBL
Assay Description
Inhibition of human recombinant MMP13
J Med Chem 52: 5408-19 (2009)
Article DOI: 10.1021/jm900809r
BindingDB Entry DOI: 10.7270/Q21J99SW
Matrix metalloproteinase-12 (MMP12)
(Homo sapiens (Human))
BDBM50295509
((S)-2-(7-(3-Benzylureido)dibenzo[b,d]thiophene-3-s...)
Show SMILES CC(C)[C@H](NS(=O)(=O)c1ccc2c(c1)sc1cc(NC(=O)NCc3ccccc3)ccc21)C(O)=O |r|
Show InChI InChI=1S/C25H25N3O5S2/c1-15(2)23(24(29)30)28-35(32,33)18-9-11-20-19-10-8-17(12-21(19)34-22(20)13-18)27-25(31)26-14-16-6-4-3-5-7-16/h3-13,15,23,28H,14H2,1-2H3,(H,29,30)(H2,26,27,31)/t23-/m0/s1
Reactome pathway
n/an/a 34n/an/an/an/an/an/a
Wyeth Research
Curated by ChEMBL
Assay Description
Inhibition of human recombinant MMP12
J Med Chem 52: 5408-19 (2009)
Article DOI: 10.1021/jm900809r
BindingDB Entry DOI: 10.7270/Q21J99SW