BDBM50295570 3,4-Dihydro-6,8-dimethyl-3-[2-(6-methylnaphthoyl)]-2H-pyrido[1,2-a]pyrimidine perchlorate::CHEMBL563369
SMILES: Cc1cc(C)n2CC(CN[c+]2c1)C(=O)c1ccc2cc(C)ccc2c1
InChI Key: InChIKey=RGTRSBQTZKBVSB-UHFFFAOYSA-O
Data: 3 IC50
Activity Spreadsheet -- Enzyme Inhibition Constant Data from BindingDB
Found 3 hits for monomerid = 50295570
Trg + Lig
Ki
nM
ΔG°
kcal/mole
IC50
nM
Kd
nM
EC50/IC50
nM
koff
s-1
kon
M-1s-1
pHTemp
°C
Nitric Oxide Synthase, endothelial
(Bos taurus (bovine))
BDBM50295570
(3,4-Dihydro-6,8-dimethyl-3-[2-(6-methylnaphthoyl)]...)
Show SMILES Cc1cc(C)n2CC(CN[c+]2c1)C(=O)c1ccc2cc(C)ccc2c1
Show InChI InChI=1S/C22H22N2O/c1-14-4-5-18-11-19(7-6-17(18)9-14)22(25)20-12-23-21-10-15(2)8-16(3)24(21)13-20/h4-11,20H,12-13H2,1-3H3/p+1
n/an/a 5.30E+4n/an/an/an/an/an/a
Christian-Albrechts-University of Kiel
Curated by ChEMBL
Assay Description
Inhibition of bovine recombinant eNOS expressed in Escherichia coli assessed as conversion of [gamma-14C]L-arginine to [14C]L-citrulline by radioacti...
Eur J Med Chem 44: 2877-87 (2009)
Article DOI: 10.1016/j.ejmech.2008.12.007
BindingDB Entry DOI: 10.7270/Q2KD1ZV6
Nitric-oxide synthase, brain
(Rattus norvegicus (rat))
BDBM50295570
(3,4-Dihydro-6,8-dimethyl-3-[2-(6-methylnaphthoyl)]...)
Show SMILES Cc1cc(C)n2CC(CN[c+]2c1)C(=O)c1ccc2cc(C)ccc2c1
Show InChI InChI=1S/C22H22N2O/c1-14-4-5-18-11-19(7-6-17(18)9-14)22(25)20-12-23-21-10-15(2)8-16(3)24(21)13-20/h4-11,20H,12-13H2,1-3H3/p+1
n/an/a 6.00E+4n/an/an/an/an/an/a
Christian-Albrechts-University of Kiel
Curated by ChEMBL
Assay Description
Inhibition of rat recombinant nNOS expressed in Saccharomyces cerevisiae assessed as conversion of [gamma-14C]L-arginine to [14C]L-citrulline by radi...
Eur J Med Chem 44: 2877-87 (2009)
Article DOI: 10.1016/j.ejmech.2008.12.007
BindingDB Entry DOI: 10.7270/Q2KD1ZV6
Nitric Oxide Synthase, inducible
(Mus musculus (mouse))
BDBM50295570
(3,4-Dihydro-6,8-dimethyl-3-[2-(6-methylnaphthoyl)]...)
Show SMILES Cc1cc(C)n2CC(CN[c+]2c1)C(=O)c1ccc2cc(C)ccc2c1
Show InChI InChI=1S/C22H22N2O/c1-14-4-5-18-11-19(7-6-17(18)9-14)22(25)20-12-23-21-10-15(2)8-16(3)24(21)13-20/h4-11,20H,12-13H2,1-3H3/p+1
Reactome pathway
n/an/a 3.50E+4n/an/an/an/an/an/a
Christian-Albrechts-University of Kiel
Curated by ChEMBL
Assay Description
Inhibition of mouse recombinant iNOS expressed in Escherichia coli assessed as conversion of [gamma-14C]L-arginine to [14C]L-citrulline by radioactiv...
Eur J Med Chem 44: 2877-87 (2009)
Article DOI: 10.1016/j.ejmech.2008.12.007
BindingDB Entry DOI: 10.7270/Q2KD1ZV6