BDBM50295919 3-(1-(4-(1H-Imidazol-1-yl)butyl)-1H-indol-3-yl)-4-(1Hpyrrolo[3,2-b]pyridin-1-yl)-1H-pyrrole-2,5-dione::CHEMBL557647
SMILES: O=C1NC(=O)C(=C1c1cn(CCCCn2ccnc2)c2ccccc12)n1ccc2ncccc12
InChI Key: InChIKey=INUBHWSBTITUPW-UHFFFAOYSA-N
Data: 1 IC50
Activity Spreadsheet -- Enzyme Inhibition Constant Data from BindingDB
Found 1 hit for monomerid = 50295919
Trg + Lig
Ki
nM
ΔG°
kcal/mole
IC50
nM
Kd
nM
EC50/IC50
nM
koff
s-1
kon
M-1s-1
pHTemp
°C
Glycogen synthase kinase-3 beta
(Homo sapiens (Human))
BDBM50295919
(3-(1-(4-(1H-Imidazol-1-yl)butyl)-1H-indol-3-yl)-4-...)
Show SMILES O=C1NC(=O)C(=C1c1cn(CCCCn2ccnc2)c2ccccc12)n1ccc2ncccc12 |c:5|
Show InChI InChI=1S/C26H22N6O2/c33-25-23(24(26(34)29-25)32-14-9-20-22(32)8-5-10-28-20)19-16-31(21-7-2-1-6-18(19)21)13-4-3-12-30-15-11-27-17-30/h1-2,5-11,14-17H,3-4,12-13H2,(H,29,33,34)
NCI pathway
Reactome pathway
n/an/a 850n/an/an/an/an/an/a
Zhejiang University
Curated by ChEMBL
Assay Description
Inhibition of recombinant GST-GSK3beta expressed in Escherichia coli BL21 (DE3)
Bioorg Med Chem 17: 4302-12 (2009)
Article DOI: 10.1016/j.bmc.2009.05.031
BindingDB Entry DOI: 10.7270/Q2XP750M