BDBM50296251 4-(5-bromo-4-(prop-2-ynylamino)pyrimidin-2-ylamino)benzenesulfonamide::CHEMBL549757
SMILES: NS(=O)(=O)c1ccc(Nc2ncc(Br)c(NCC#C)n2)cc1
InChI Key: InChIKey=HBITXFFJRLBCBB-UHFFFAOYSA-N
Data: 1 IC50
Activity Spreadsheet -- Enzyme Inhibition Constant Data from BindingDB
Found 1 hit for monomerid = 50296251
Trg + Lig
Ki
nM
ΔG°
kcal/mole
IC50
nM
Kd
nM
EC50/IC50
nM
koff
s-1
kon
M-1s-1
pHTemp
°C
Carbonic anhydrase 2
(Homo sapiens (Human))
BDBM50296251
(4-(5-bromo-4-(prop-2-ynylamino)pyrimidin-2-ylamino...)
Show SMILES NS(=O)(=O)c1ccc(Nc2ncc(Br)c(NCC#C)n2)cc1
Show InChI InChI=1S/C13H12BrN5O2S/c1-2-7-16-12-11(14)8-17-13(19-12)18-9-3-5-10(6-4-9)22(15,20)21/h1,3-6,8H,7H2,(H2,15,20,21)(H2,16,17,18,19)
Reactome pathway
n/an/a 331n/an/an/an/an/an/a
University of Tampere and Tampere University Hospital
Curated by ChEMBL
Assay Description
Inhibition of human carbonic anhydrase 2 by stopped flow CO2 hydration assay
Bioorg Med Chem Lett 19: 4102-6 (2009)
Article DOI: 10.1016/j.bmcl.2009.06.002
BindingDB Entry DOI: 10.7270/Q23778S7