BDBM50296585 (1S,3R)-N-((1,4-dimethyl-5-(3,4,5-trifluorophenyl)-1H-pyrazol-3-yl)methyl)-3-fluorocyclopentanamine::CHEMBL549439
SMILES: Cc1c(CN[C@H]2CC[C@@H](F)C2)nn(C)c1-c1cc(F)c(F)c(F)c1
InChI Key: InChIKey=LLSBPKPNVGJBRE-NEPJUHHUSA-N
Data: 2 IC50
Activity Spreadsheet -- Enzyme Inhibition Constant Data from BindingDB
Found 2 hits for monomerid = 50296585
Trg + Lig
Ki
nM
ΔG°
kcal/mole
IC50
nM
Kd
nM
EC50/IC50
nM
koff
s-1
kon
M-1s-1
pHTemp
°C
Nociceptin receptor
(Homo sapiens (Human))
BDBM50296585
((1S,3R)-N-((1,4-dimethyl-5-(3,4,5-trifluorophenyl)...)
Show SMILES Cc1c(CN[C@H]2CC[C@@H](F)C2)nn(C)c1-c1cc(F)c(F)c(F)c1 |r|
Show InChI InChI=1S/C17H19F4N3/c1-9-15(8-22-12-4-3-11(18)7-12)23-24(2)17(9)10-5-13(19)16(21)14(20)6-10/h5-6,11-12,22H,3-4,7-8H2,1-2H3/t11-,12+/m1/s1
Reactome pathway
n/an/a 13n/an/an/an/an/an/a
Tsukuba Research Institute
Curated by ChEMBL
Assay Description
Displacement of [125I]Tyr14-NC/OFQ from ORL1 receptor
Bioorg Med Chem Lett 19: 4729-32 (2009)
Article DOI: 10.1016/j.bmcl.2009.06.051
BindingDB Entry DOI: 10.7270/Q2H9958F
Nociceptin receptor
(Homo sapiens (Human))
BDBM50296585
((1S,3R)-N-((1,4-dimethyl-5-(3,4,5-trifluorophenyl)...)
Show SMILES Cc1c(CN[C@H]2CC[C@@H](F)C2)nn(C)c1-c1cc(F)c(F)c(F)c1 |r|
Show InChI InChI=1S/C17H19F4N3/c1-9-15(8-22-12-4-3-11(18)7-12)23-24(2)17(9)10-5-13(19)16(21)14(20)6-10/h5-6,11-12,22H,3-4,7-8H2,1-2H3/t11-,12+/m1/s1
Reactome pathway
n/an/a 15n/an/an/an/an/an/a
Tsukuba Research Institute
Curated by ChEMBL
Assay Description
Displacement of [125I]Tyr14-NC/OFQ from ORL1 receptor
Bioorg Med Chem Lett 19: 4729-32 (2009)
Article DOI: 10.1016/j.bmcl.2009.06.051
BindingDB Entry DOI: 10.7270/Q2H9958F