null
SMILES: OC(=O)[C@@H](CNC(=O)c1ccccc1)NS(=O)(=O)c1cccc(Cl)c1Cl
InChI Key: InChIKey=SZPMPHVFAYJDEX-GFCCVEGCSA-N
Activity Spreadsheet -- Enzyme Inhibition Constant Data from BindingDB
Found 1 hit for monomerid = 50296600
Trg + Lig
Ki
nM
ΔG°
kcal/mole
IC50
nM
Kd
nM
EC50/IC50
nM
koff
s-1
kon
M-1s-1
pHTemp
°C
Integrin alpha-V
(Homo sapiens (Human))
BDBM50296600
((R)-3-benzamido-2-(2,3-dichlorophenylsulfonamido)p...)
Show SMILES OC(=O)[C@@H](CNC(=O)c1ccccc1)NS(=O)(=O)c1cccc(Cl)c1Cl |r|
Show InChI InChI=1S/C16H14Cl2N2O5S/c17-11-7-4-8-13(14(11)18)26(24,25)20-12(16(22)23)9-19-15(21)10-5-2-1-3-6-10/h1-8,12,20H,9H2,(H,19,21)(H,22,23)/t12-/m1/s1
NCI pathway
Reactome pathway
n/an/a 62n/an/an/an/an/an/a
AstraZeneca
Curated by ChEMBL
Assay Description
Inhibition of fibrinogen binding to alphavbeta3 integrin
Bioorg Med Chem Lett 19: 4832-5 (2009)
Article DOI: 10.1016/j.bmcl.2009.06.041
BindingDB Entry DOI: 10.7270/Q2CJ8DJQ