BDBM50296788 2-((S)-5-methyl-4-oxo-2a,3,4,5-tetrahydropyrrolo[4,3,2-de]quinolin-1(2H)-yl)-N-((S)-2'-oxo-1,1',2',3-tetrahydrospiro[indene-2,3'-pyrrolo[2,3-b]pyridine]-5-yl)acetamide::CHEMBL556703
SMILES: CN1C(=O)C[C@@H]2CN(CC(=O)Nc3ccc4C[C@@]5(Cc4c3)C(=O)Nc3ncccc53)c3cccc1c23
InChI Key: InChIKey=BXLDLKVUVUTHPO-WRHNGFHOSA-N
Data: 1 KI  2 IC50
Activity Spreadsheet -- Enzyme Inhibition Constant Data from BindingDB
Found 3 hits for monomerid = 50296788
Trg + Lig
Ki
nM
ΔG°
kcal/mole
IC50
nM
Kd
nM
EC50/IC50
nM
koff
s-1
kon
M-1s-1
pHTemp
°C
Calcitonin gene-related peptide type 1 receptor
(Homo sapiens (Human))
BDBM50296788
(2-((S)-5-methyl-4-oxo-2a,3,4,5-tetrahydropyrrolo[4...)
Show SMILES CN1C(=O)C[C@@H]2CN(CC(=O)Nc3ccc4C[C@@]5(Cc4c3)C(=O)Nc3ncccc53)c3cccc1c23 |r|
Show InChI InChI=1S/C28H25N5O3/c1-32-21-5-2-6-22-25(21)18(11-24(32)35)14-33(22)15-23(34)30-19-8-7-16-12-28(13-17(16)10-19)20-4-3-9-29-26(20)31-27(28)36/h2-10,18H,11-15H2,1H3,(H,30,34)(H,29,31,36)/t18-,28+/m1/s1
Reactome pathway
9.70n/an/an/an/an/an/an/an/a
Merck Research Laboratories
Curated by ChEMBL
Assay Description
Displacement of [125I]human CGRP from human CLR expressed in HEK293 cells coexpressing human RAMP1
Bioorg Med Chem Lett 19: 4740-2 (2009)
Article DOI: 10.1016/j.bmcl.2009.06.057
BindingDB Entry DOI: 10.7270/Q2QV3MJH
Calcitonin gene-related peptide type 1 receptor
(Homo sapiens (Human))
BDBM50296788
(2-((S)-5-methyl-4-oxo-2a,3,4,5-tetrahydropyrrolo[4...)
Show SMILES CN1C(=O)C[C@@H]2CN(CC(=O)Nc3ccc4C[C@@]5(Cc4c3)C(=O)Nc3ncccc53)c3cccc1c23 |r|
Show InChI InChI=1S/C28H25N5O3/c1-32-21-5-2-6-22-25(21)18(11-24(32)35)14-33(22)15-23(34)30-19-8-7-16-12-28(13-17(16)10-19)20-4-3-9-29-26(20)31-27(28)36/h2-10,18H,11-15H2,1H3,(H,30,34)(H,29,31,36)/t18-,28+/m1/s1
Reactome pathway
n/an/a 530n/an/an/an/an/an/a
Merck Research Laboratories
Curated by ChEMBL
Assay Description
Antagonist activity at human CLR expressed in HEK293 cells coexpressing human RAMP1 assessed as inhibition of human CGRPalpha-induced cAMP production...
Bioorg Med Chem Lett 19: 4740-2 (2009)
Article DOI: 10.1016/j.bmcl.2009.06.057
BindingDB Entry DOI: 10.7270/Q2QV3MJH
Calcitonin gene-related peptide type 1 receptor
(Homo sapiens (Human))
BDBM50296788
(2-((S)-5-methyl-4-oxo-2a,3,4,5-tetrahydropyrrolo[4...)
Show SMILES CN1C(=O)C[C@@H]2CN(CC(=O)Nc3ccc4C[C@@]5(Cc4c3)C(=O)Nc3ncccc53)c3cccc1c23 |r|
Show InChI InChI=1S/C28H25N5O3/c1-32-21-5-2-6-22-25(21)18(11-24(32)35)14-33(22)15-23(34)30-19-8-7-16-12-28(13-17(16)10-19)20-4-3-9-29-26(20)31-27(28)36/h2-10,18H,11-15H2,1H3,(H,30,34)(H,29,31,36)/t18-,28+/m1/s1
Reactome pathway
n/an/a 37n/an/an/an/an/an/a
Merck Research Laboratories
Curated by ChEMBL
Assay Description
Antagonist activity at human CLR expressed in HEK293 cells coexpressing human RAMP1 assessed as inhibition of human CGRPalpha-induced cAMP production...
Bioorg Med Chem Lett 19: 4740-2 (2009)
Article DOI: 10.1016/j.bmcl.2009.06.057
BindingDB Entry DOI: 10.7270/Q2QV3MJH