BDBM50296870 (1-((1R,4R)-4-((R)-1-(4-methoxyphenyl)ethylamino)-2,2-dimethylcyclohexanecarbonyl)-4-phenylpiperidin-4-yl)(pyrrolidin-1-yl)methanone::CHEMBL561999
SMILES: COc1ccc(cc1)[C@@H](C)N[C@@H]1CC[C@@H](C(=O)N2CCC(CC2)(C(=O)N2CCCC2)c2ccccc2)C(C)(C)C1
InChI Key: InChIKey=RMJYPZJDYDKLTB-CZMKHNCBSA-N
Data: 1 KI  2 IC50
Activity Spreadsheet -- Enzyme Inhibition Constant Data from BindingDB
Found 3 hits for monomerid = 50296870
Trg + Lig
Ki
nM
ΔG°
kcal/mole
IC50
nM
Kd
nM
EC50/IC50
nM
koff
s-1
kon
M-1s-1
pHTemp
°C
Neuropeptide Y receptor type 1
(Homo sapiens (Human))
BDBM50296870
((1-((1R,4R)-4-((R)-1-(4-methoxyphenyl)ethylamino)-...)
Show SMILES COc1ccc(cc1)[C@@H](C)N[C@@H]1CC[C@@H](C(=O)N2CCC(CC2)(C(=O)N2CCCC2)c2ccccc2)C(C)(C)C1 |r|
Show InChI InChI=1S/C34H47N3O3/c1-25(26-12-15-29(40-4)16-13-26)35-28-14-17-30(33(2,3)24-28)31(38)36-22-18-34(19-23-36,27-10-6-5-7-11-27)32(39)37-20-8-9-21-37/h5-7,10-13,15-16,25,28,30,35H,8-9,14,17-24H2,1-4H3/t25-,28-,30+/m1/s1
Reactome pathway
7.30n/an/an/an/an/an/an/an/a
Tsukuba Research Institute
Curated by ChEMBL
Assay Description
Displacement of [125I]PYY from human recombinant neuropeptide Y1 receptor expressed in CHO (NFAT-bla) cells by scintillation counting
Bioorg Med Chem Lett 19: 4781-5 (2009)
Article DOI: 10.1016/j.bmcl.2009.06.050
BindingDB Entry DOI: 10.7270/Q2319VXR
Sodium-dependent serotonin transporter
(Homo sapiens (Human))
BDBM50296870
((1-((1R,4R)-4-((R)-1-(4-methoxyphenyl)ethylamino)-...)
Show SMILES COc1ccc(cc1)[C@@H](C)N[C@@H]1CC[C@@H](C(=O)N2CCC(CC2)(C(=O)N2CCCC2)c2ccccc2)C(C)(C)C1 |r|
Show InChI InChI=1S/C34H47N3O3/c1-25(26-12-15-29(40-4)16-13-26)35-28-14-17-30(33(2,3)24-28)31(38)36-22-18-34(19-23-36,27-10-6-5-7-11-27)32(39)37-20-8-9-21-37/h5-7,10-13,15-16,25,28,30,35H,8-9,14,17-24H2,1-4H3/t25-,28-,30+/m1/s1
n/an/a 17n/an/an/an/an/an/a
Tsukuba Research Institute
Curated by ChEMBL
Assay Description
Displacement of [3H]imipramine from human serotonin transporter expressed in CHO cell membrane by scintillation counting
Bioorg Med Chem Lett 19: 4781-5 (2009)
Article DOI: 10.1016/j.bmcl.2009.06.050
BindingDB Entry DOI: 10.7270/Q2319VXR
Potassium voltage-gated channel subfamily H member 2
(Homo sapiens (Human))
BDBM50296870
((1-((1R,4R)-4-((R)-1-(4-methoxyphenyl)ethylamino)-...)
Show SMILES COc1ccc(cc1)[C@@H](C)N[C@@H]1CC[C@@H](C(=O)N2CCC(CC2)(C(=O)N2CCCC2)c2ccccc2)C(C)(C)C1 |r|
Show InChI InChI=1S/C34H47N3O3/c1-25(26-12-15-29(40-4)16-13-26)35-28-14-17-30(33(2,3)24-28)31(38)36-22-18-34(19-23-36,27-10-6-5-7-11-27)32(39)37-20-8-9-21-37/h5-7,10-13,15-16,25,28,30,35H,8-9,14,17-24H2,1-4H3/t25-,28-,30+/m1/s1
Reactome pathway
n/an/a>1.00E+4n/an/an/an/an/an/a
Tsukuba Research Institute
Curated by ChEMBL
Assay Description
Displacement of [35S]MK499 from human ERG potassium channel expressed in HEK293 cells
Bioorg Med Chem Lett 19: 4781-5 (2009)
Article DOI: 10.1016/j.bmcl.2009.06.050
BindingDB Entry DOI: 10.7270/Q2319VXR