null
SMILES:
InChI Key: InChIKey=RURMBSCVCKOVLA-CWLDZYDQSA-N
Activity Spreadsheet -- Enzyme Inhibition Constant Data from BindingDB
Found 3 hits for monomerid = 50296875
Trg + Lig
Ki
nM
ΔG°
kcal/mole
IC50
nM
Kd
nM
EC50/IC50
nM
koff
s-1
kon
M-1s-1
pHTemp
°C
Neuropeptide Y receptor type 1
(Homo sapiens (Human))
BDBM50296875
(CHEMBL556915 | N-(4-((1R,4R)-4-((R)-1-(4-methoxyph...)
Show InChI InChI=1S/C32H44N2O3/c1-22(24-11-14-28(37-5)15-12-24)33-27-13-16-29(31(3,4)21-27)30(36)25-17-19-32(20-18-25,34-23(2)35)26-9-7-6-8-10-26/h6-12,14-15,22,25,27,29,33H,13,16-21H2,1-5H3,(H,34,35)/t22-,25?,27-,29+,32?/m1/s1
Reactome pathway
48n/an/an/an/an/an/an/an/a
Tsukuba Research Institute
Curated by ChEMBL
Assay Description
Displacement of [125I]PYY from human recombinant neuropeptide Y1 receptor expressed in CHO (NFAT-bla) cells by scintillation counting
Bioorg Med Chem Lett 19: 4781-5 (2009)
Article DOI: 10.1016/j.bmcl.2009.06.050
BindingDB Entry DOI: 10.7270/Q2319VXR
Sodium-dependent serotonin transporter
(Homo sapiens (Human))
BDBM50296875
(CHEMBL556915 | N-(4-((1R,4R)-4-((R)-1-(4-methoxyph...)
Show InChI InChI=1S/C32H44N2O3/c1-22(24-11-14-28(37-5)15-12-24)33-27-13-16-29(31(3,4)21-27)30(36)25-17-19-32(20-18-25,34-23(2)35)26-9-7-6-8-10-26/h6-12,14-15,22,25,27,29,33H,13,16-21H2,1-5H3,(H,34,35)/t22-,25?,27-,29+,32?/m1/s1
n/an/a 26n/an/an/an/an/an/a
Tsukuba Research Institute
Curated by ChEMBL
Assay Description
Displacement of [3H]imipramine from human serotonin transporter expressed in CHO cell membrane by scintillation counting
Bioorg Med Chem Lett 19: 4781-5 (2009)
Article DOI: 10.1016/j.bmcl.2009.06.050
BindingDB Entry DOI: 10.7270/Q2319VXR
Potassium voltage-gated channel subfamily H member 2
(Homo sapiens (Human))
BDBM50296875
(CHEMBL556915 | N-(4-((1R,4R)-4-((R)-1-(4-methoxyph...)
Show InChI InChI=1S/C32H44N2O3/c1-22(24-11-14-28(37-5)15-12-24)33-27-13-16-29(31(3,4)21-27)30(36)25-17-19-32(20-18-25,34-23(2)35)26-9-7-6-8-10-26/h6-12,14-15,22,25,27,29,33H,13,16-21H2,1-5H3,(H,34,35)/t22-,25?,27-,29+,32?/m1/s1
Reactome pathway
n/an/a>1.00E+4n/an/an/an/an/an/a
Tsukuba Research Institute
Curated by ChEMBL
Assay Description
Displacement of [35S]MK499 from human ERG potassium channel expressed in HEK293 cells
Bioorg Med Chem Lett 19: 4781-5 (2009)
Article DOI: 10.1016/j.bmcl.2009.06.050
BindingDB Entry DOI: 10.7270/Q2319VXR