null
SMILES: CN1[C@@H]2CC[C@H]3[C@@H]4C[C@@H](Cc5cccc(F)c5)[C@H](O)[C@@]4(C)CC[C@@H]3[C@@]2(C)C=CC1=O
InChI Key: InChIKey=WWYCEUZRECUBAR-NKRFCKFISA-N
Activity Spreadsheet -- Enzyme Inhibition Constant Data from BindingDB
Found 3 hits for monomerid = 50296935
Trg + Lig
Ki
nM
ΔG°
kcal/mole
IC50
nM
Kd
nM
EC50/IC50
nM
koff
s-1
kon
M-1s-1
pHTemp
°C
Potassium voltage-gated channel subfamily H member 2
(Homo sapiens (Human))
BDBM50296935
(16alpha-(3-Fluorobenzyl)-17beta-hydroxy-4-methyl-4...)
Show SMILES CN1[C@@H]2CC[C@H]3[C@@H]4C[C@@H](Cc5cccc(F)c5)[C@H](O)[C@@]4(C)CC[C@@H]3[C@@]2(C)C=CC1=O |r,c:30|
Show InChI InChI=1S/C26H34FNO2/c1-25-12-10-23(29)28(3)22(25)8-7-19-20(25)9-11-26(2)21(19)15-17(24(26)30)13-16-5-4-6-18(27)14-16/h4-6,10,12,14,17,19-22,24,30H,7-9,11,13,15H2,1-3H3/t17-,19-,20+,21+,22-,24+,25-,26+/m1/s1
Reactome pathway
240n/an/an/an/an/an/an/an/a
Merck Research Laboratories
Curated by ChEMBL
Assay Description
Binding affinity to human ERG potassium channel
J Med Chem 52: 4578-81 (2009)
Article DOI: 10.1021/jm900880r
BindingDB Entry DOI: 10.7270/Q2K35TPQ
Androgen receptor
(Homo sapiens (Human))
BDBM50296935
(16alpha-(3-Fluorobenzyl)-17beta-hydroxy-4-methyl-4...)
Show SMILES CN1[C@@H]2CC[C@H]3[C@@H]4C[C@@H](Cc5cccc(F)c5)[C@H](O)[C@@]4(C)CC[C@@H]3[C@@]2(C)C=CC1=O |r,c:30|
Show InChI InChI=1S/C26H34FNO2/c1-25-12-10-23(29)28(3)22(25)8-7-19-20(25)9-11-26(2)21(19)15-17(24(26)30)13-16-5-4-6-18(27)14-16/h4-6,10,12,14,17,19-22,24,30H,7-9,11,13,15H2,1-3H3/t17-,19-,20+,21+,22-,24+,25-,26+/m1/s1
NCI pathway
Reactome pathway
n/an/a 23n/an/an/an/an/an/a
Merck Research Laboratories
Curated by ChEMBL
Assay Description
Displacement of [3H]methyltrienolone from androgen receptor in human MDA-MB-453 cells
J Med Chem 52: 4578-81 (2009)
Article DOI: 10.1021/jm900880r
BindingDB Entry DOI: 10.7270/Q2K35TPQ
Androgen receptor
(Homo sapiens (Human))
BDBM50296935
(16alpha-(3-Fluorobenzyl)-17beta-hydroxy-4-methyl-4...)
Show SMILES CN1[C@@H]2CC[C@H]3[C@@H]4C[C@@H](Cc5cccc(F)c5)[C@H](O)[C@@]4(C)CC[C@@H]3[C@@]2(C)C=CC1=O |r,c:30|
Show InChI InChI=1S/C26H34FNO2/c1-25-12-10-23(29)28(3)22(25)8-7-19-20(25)9-11-26(2)21(19)15-17(24(26)30)13-16-5-4-6-18(27)14-16/h4-6,10,12,14,17,19-22,24,30H,7-9,11,13,15H2,1-3H3/t17-,19-,20+,21+,22-,24+,25-,26+/m1/s1
NCI pathway
Reactome pathway
n/an/an/an/a 14n/an/an/an/a
Merck Research Laboratories
Curated by ChEMBL
Assay Description
Agonist activity at androgen receptor in human MDA-MB-453 cells transfected with MMTV-LUC assessed as induction of MMTV-LTR/promoter linked LUC gene ...
J Med Chem 52: 4578-81 (2009)
Article DOI: 10.1021/jm900880r
BindingDB Entry DOI: 10.7270/Q2K35TPQ