null
SMILES: CN1[C@@H]2CC[C@H]3[C@@H]4C\C(=C/c5cccnc5)[C@H](O)[C@@]4(C)CC[C@@H]3[C@@]2(C)C=CC1=O
InChI Key: InChIKey=UMXDCWKYQFLOJM-NUPZHGKZSA-N
Activity Spreadsheet -- Enzyme Inhibition Constant Data from BindingDB
Found 3 hits for monomerid = 50296942
Trg + Lig
Ki
nM
ΔG°
kcal/mole
IC50
nM
Kd
nM
EC50/IC50
nM
koff
s-1
kon
M-1s-1
pHTemp
°C
Potassium voltage-gated channel subfamily H member 2
(Homo sapiens (Human))
BDBM50296942
(16-(Pyridin-3-ylmethylidene)-17beta-hydroxy-4-meth...)
Show SMILES CN1[C@@H]2CC[C@H]3[C@@H]4C\C(=C/c5cccnc5)[C@H](O)[C@@]4(C)CC[C@@H]3[C@@]2(C)C=CC1=O |r,c:29|
Show InChI InChI=1S/C25H32N2O2/c1-24-11-9-22(28)27(3)21(24)7-6-18-19(24)8-10-25(2)20(18)14-17(23(25)29)13-16-5-4-12-26-15-16/h4-5,9,11-13,15,18-21,23,29H,6-8,10,14H2,1-3H3/b17-13+/t18-,19+,20+,21-,23+,24-,25+/m1/s1
Reactome pathway
3.60E+3n/an/an/an/an/an/an/an/a
Merck Research Laboratories
Curated by ChEMBL
Assay Description
Binding affinity to human ERG potassium channel
J Med Chem 52: 4578-81 (2009)
Article DOI: 10.1021/jm900880r
BindingDB Entry DOI: 10.7270/Q2K35TPQ
Androgen receptor
(Homo sapiens (Human))
BDBM50296942
(16-(Pyridin-3-ylmethylidene)-17beta-hydroxy-4-meth...)
Show SMILES CN1[C@@H]2CC[C@H]3[C@@H]4C\C(=C/c5cccnc5)[C@H](O)[C@@]4(C)CC[C@@H]3[C@@]2(C)C=CC1=O |r,c:29|
Show InChI InChI=1S/C25H32N2O2/c1-24-11-9-22(28)27(3)21(24)7-6-18-19(24)8-10-25(2)20(18)14-17(23(25)29)13-16-5-4-12-26-15-16/h4-5,9,11-13,15,18-21,23,29H,6-8,10,14H2,1-3H3/b17-13+/t18-,19+,20+,21-,23+,24-,25+/m1/s1
NCI pathway
Reactome pathway
n/an/a 62n/an/an/an/an/an/a
Merck Research Laboratories
Curated by ChEMBL
Assay Description
Displacement of [3H]methyltrienolone from androgen receptor in human MDA-MB-453 cells
J Med Chem 52: 4578-81 (2009)
Article DOI: 10.1021/jm900880r
BindingDB Entry DOI: 10.7270/Q2K35TPQ
Androgen receptor
(Homo sapiens (Human))
BDBM50296942
(16-(Pyridin-3-ylmethylidene)-17beta-hydroxy-4-meth...)
Show SMILES CN1[C@@H]2CC[C@H]3[C@@H]4C\C(=C/c5cccnc5)[C@H](O)[C@@]4(C)CC[C@@H]3[C@@]2(C)C=CC1=O |r,c:29|
Show InChI InChI=1S/C25H32N2O2/c1-24-11-9-22(28)27(3)21(24)7-6-18-19(24)8-10-25(2)20(18)14-17(23(25)29)13-16-5-4-12-26-15-16/h4-5,9,11-13,15,18-21,23,29H,6-8,10,14H2,1-3H3/b17-13+/t18-,19+,20+,21-,23+,24-,25+/m1/s1
NCI pathway
Reactome pathway
n/an/an/an/a 62n/an/an/an/a
Merck Research Laboratories
Curated by ChEMBL
Assay Description
Agonist activity at androgen receptor in human MDA-MB-453 cells transfected with MMTV-LUC assessed as induction of MMTV-LTR/promoter linked LUC gene ...
J Med Chem 52: 4578-81 (2009)
Article DOI: 10.1021/jm900880r
BindingDB Entry DOI: 10.7270/Q2K35TPQ