BDBM50297168 2-Phenylsulfanylbenzamide::CHEMBL551610
SMILES: NC(=O)c1ccccc1Sc1ccccc1
InChI Key: InChIKey=CPTFVDLLWNPUGJ-UHFFFAOYSA-N
Data: 3 IC50
Activity Spreadsheet -- Enzyme Inhibition Constant Data from BindingDB
Found 3 hits for monomerid = 50297168
Trg + Lig
Ki
nM
ΔG°
kcal/mole
IC50
nM
Kd
nM
EC50/IC50
nM
koff
s-1
kon
M-1s-1
pHTemp
°C
NAD-dependent protein deacetylase sirtuin-1
(Homo sapiens (Human))
BDBM50297168
(2-Phenylsulfanylbenzamide | CHEMBL551610)
Show SMILES NC(=O)c1ccccc1Sc1ccccc1
Show InChI InChI=1S/C13H11NOS/c14-13(15)11-8-4-5-9-12(11)16-10-6-2-1-3-7-10/h1-9H,(H2,14,15)
NCI pathway
Reactome pathway
n/an/a 7.80E+4n/an/an/an/an/an/a
Nagoya City University
Curated by ChEMBL
Assay Description
Inhibition of human recombinant SIRT1 by fluorimetric analysis
Bioorg Med Chem 17: 5900-5 (2009)
Article DOI: 10.1016/j.bmc.2009.07.001
BindingDB Entry DOI: 10.7270/Q24X57TQ
NAD-dependent protein deacetylase sirtuin-1
(Homo sapiens (Human))
BDBM50297168
(2-Phenylsulfanylbenzamide | CHEMBL551610)
Show SMILES NC(=O)c1ccccc1Sc1ccccc1
Show InChI InChI=1S/C13H11NOS/c14-13(15)11-8-4-5-9-12(11)16-10-6-2-1-3-7-10/h1-9H,(H2,14,15)
NCI pathway
Reactome pathway
n/an/a 7.80E+4n/an/an/an/an/an/a
Kyoto Prefectural University of Medicine
Curated by ChEMBL
Assay Description
Inhibition of human recombinant SIRT1 using Fluor de Lys-SIRT as substrate incubated for 60 mins prior to substrate addition measured after 60 mins b...
J Med Chem 55: 5760-73 (2012)
Article DOI: 10.1021/jm3002108
BindingDB Entry DOI: 10.7270/Q2WW7JRS
NAD-dependent protein deacetylase sirtuin-2
(Homo sapiens (Human))
BDBM50297168
(2-Phenylsulfanylbenzamide | CHEMBL551610)
Show SMILES NC(=O)c1ccccc1Sc1ccccc1
Show InChI InChI=1S/C13H11NOS/c14-13(15)11-8-4-5-9-12(11)16-10-6-2-1-3-7-10/h1-9H,(H2,14,15)
NCI pathway
n/an/a>1.00E+5n/an/an/an/an/an/a
Kyoto Prefectural University of Medicine
Curated by ChEMBL
Assay Description
Inhibition of human recombinant SIRT2 using Fluor de Lys-SIRT as substrate incubated for 60 mins prior to substrate addition measured after 60 mins b...
J Med Chem 55: 5760-73 (2012)
Article DOI: 10.1021/jm3002108
BindingDB Entry DOI: 10.7270/Q2WW7JRS