BDBM50297303 (S)-5-(1H-benzo[d]imidazol-2-yloxy)-4-((S)-2-((S)-2-amino-3-(4-hydroxy-2,6-dimethylphenyl)propanoyl)-1,2,3,4-tetrahydroisoquinoline-3-carboxamido)-5-oxopentanoic acid::CHEMBL540724
SMILES: Cc1cc(O)cc(C)c1C[C@H](N)C(=O)N1Cc2ccccc2C[C@H]1C(=O)N[C@@H](CCC(O)=O)C(=O)c1nc2ccccc2[nH]1
InChI Key: InChIKey=QKQBZZDURLHJMJ-WIRXVTQYSA-N
Data: 2 KI  1 IC50
Activity Spreadsheet -- Enzyme Inhibition Constant Data from BindingDB
Found 3 hits for monomerid = 50297303
Trg + Lig
Ki
nM
ΔG°
kcal/mole
IC50
nM
Kd
nM
EC50/IC50
nM
koff
s-1
kon
M-1s-1
pHTemp
°C
Opioid receptors; mu & delta
(Rattus norvegicus (rat))
BDBM50297303
((S)-5-(1H-benzo[d]imidazol-2-yloxy)-4-((S)-2-((S)-...)
Show SMILES Cc1cc(O)cc(C)c1C[C@H](N)C(=O)N1Cc2ccccc2C[C@H]1C(=O)N[C@@H](CCC(O)=O)C(=O)c1nc2ccccc2[nH]1 |r|
Show InChI InChI=1S/C33H35N5O6/c1-18-13-22(39)14-19(2)23(18)16-24(34)33(44)38-17-21-8-4-3-7-20(21)15-28(38)32(43)37-27(11-12-29(40)41)30(42)31-35-25-9-5-6-10-26(25)36-31/h3-10,13-14,24,27-28,39H,11-12,15-17,34H2,1-2H3,(H,35,36)(H,37,43)(H,40,41)/t24-,27-,28-/m0/s1
Reactome pathway
0.0400n/an/an/an/an/an/an/an/a
University of Cagliari
Curated by ChEMBL
Assay Description
Displacement of [3H]deltorphin 2 from delta opioid receptor in Sprague-Dawley rat brain P2 synaptosomal membrane
J Med Chem 52: 5556-9 (2009)
Article DOI: 10.1021/jm900686q
BindingDB Entry DOI: 10.7270/Q23X86PB
Mu-type opioid receptor
(Rattus norvegicus (rat))
BDBM50297303
((S)-5-(1H-benzo[d]imidazol-2-yloxy)-4-((S)-2-((S)-...)
Show SMILES Cc1cc(O)cc(C)c1C[C@H](N)C(=O)N1Cc2ccccc2C[C@H]1C(=O)N[C@@H](CCC(O)=O)C(=O)c1nc2ccccc2[nH]1 |r|
Show InChI InChI=1S/C33H35N5O6/c1-18-13-22(39)14-19(2)23(18)16-24(34)33(44)38-17-21-8-4-3-7-20(21)15-28(38)32(43)37-27(11-12-29(40)41)30(42)31-35-25-9-5-6-10-26(25)36-31/h3-10,13-14,24,27-28,39H,11-12,15-17,34H2,1-2H3,(H,35,36)(H,37,43)(H,40,41)/t24-,27-,28-/m0/s1
Reactome pathway
1.45n/an/an/an/an/an/an/an/a
University of Cagliari
Curated by ChEMBL
Assay Description
Displacement of [3H]DAMGO from mu opioid receptor in Sprague-Dawley rat brain P2 synaptosomal membrane
J Med Chem 52: 5556-9 (2009)
Article DOI: 10.1021/jm900686q
BindingDB Entry DOI: 10.7270/Q23X86PB
Mu-type opioid receptor
(GUINEA PIG)
BDBM50297303
((S)-5-(1H-benzo[d]imidazol-2-yloxy)-4-((S)-2-((S)-...)
Show SMILES Cc1cc(O)cc(C)c1C[C@H](N)C(=O)N1Cc2ccccc2C[C@H]1C(=O)N[C@@H](CCC(O)=O)C(=O)c1nc2ccccc2[nH]1 |r|
Show InChI InChI=1S/C33H35N5O6/c1-18-13-22(39)14-19(2)23(18)16-24(34)33(44)38-17-21-8-4-3-7-20(21)15-28(38)32(43)37-27(11-12-29(40)41)30(42)31-35-25-9-5-6-10-26(25)36-31/h3-10,13-14,24,27-28,39H,11-12,15-17,34H2,1-2H3,(H,35,36)(H,37,43)(H,40,41)/t24-,27-,28-/m0/s1
n/an/a 494n/an/an/an/an/an/a
University of Cagliari
Curated by ChEMBL
Assay Description
Agonist activity at mu opioid receptor in Hartley guinea pig longitudinal muscle myenteric plexus assessed as inhibition of electrically evoked contr...
J Med Chem 52: 5556-9 (2009)
Article DOI: 10.1021/jm900686q
BindingDB Entry DOI: 10.7270/Q23X86PB