BDBM50297612 1-(cyclopropylmethyl)-2-neopentyl-5-pentyl-4,5,6,7-tetrahydro-1H-imidazo[4,5-c]pyridine::CHEMBL565202
SMILES: CCCCCN1CCc2c(C1)nc(CC(C)(C)C)n2CC1CC1
InChI Key: InChIKey=CLZIVSVDBVEUFG-UHFFFAOYSA-N
Data: 1 EC50
Activity Spreadsheet -- Enzyme Inhibition Constant Data from BindingDB
Found 1 hit for monomerid = 50297612
Trg + Lig
Ki
nM
ΔG°
kcal/mole
IC50
nM
Kd
nM
EC50/IC50
nM
koff
s-1
kon
M-1s-1
pHTemp
°C
Cannabinoid receptor 2
(Homo sapiens (Human))
BDBM50297612
(1-(cyclopropylmethyl)-2-neopentyl-5-pentyl-4,5,6,7...)
Show SMILES CCCCCN1CCc2c(C1)nc(CC(C)(C)C)n2CC1CC1
Show InChI InChI=1S/C20H35N3/c1-5-6-7-11-22-12-10-18-17(15-22)21-19(13-20(2,3)4)23(18)14-16-8-9-16/h16H,5-15H2,1-4H3
Reactome pathway
n/an/an/an/a 3.00E+3n/an/an/an/a
Pfizer Discovery Chemistry
Curated by ChEMBL
Assay Description
Agonist activity at human recombinant CB2 receptor expressed in CHO cells assessed as inhibition forskolin-induced cAMP release
Bioorg Med Chem Lett 19: 4406-9 (2009)
Article DOI: 10.1016/j.bmcl.2009.05.062
BindingDB Entry DOI: 10.7270/Q28G8KRV