null
SMILES: CS(=O)(=O)c1ccc(cc1)-c1cc(nc(NC2CCCCC2)n1)C(F)(F)F
InChI Key: InChIKey=SFTDLGJIDMULGE-UHFFFAOYSA-N
Activity Spreadsheet -- Enzyme Inhibition Constant Data from BindingDB
Found 4 hits for monomerid = 50297669
Trg + Lig
Ki
nM
ΔG°
kcal/mole
IC50
nM
Kd
nM
EC50/IC50
nM
koff
s-1
kon
M-1s-1
pHTemp
°C
Prostaglandin G/H synthase 1
(Homo sapiens (Human))
BDBM50297669
(CHEMBL561891 | N-cyclohexyl-4-(4-(methylsulfonyl)p...)
Show SMILES CS(=O)(=O)c1ccc(cc1)-c1cc(nc(NC2CCCCC2)n1)C(F)(F)F
Show InChI InChI=1S/C18H20F3N3O2S/c1-27(25,26)14-9-7-12(8-10-14)15-11-16(18(19,20)21)24-17(23-15)22-13-5-3-2-4-6-13/h7-11,13H,2-6H2,1H3,(H,22,23,24)
n/an/a 1.16E+4n/an/an/an/an/an/a
GlaxoSmithKline
Curated by ChEMBL
Assay Description
Inhibition of COX1 in human whole blood assessed as inhibition of lipopolysaccharide-induced TxB2 production after 30 min by enzyme immunoassay
Bioorg Med Chem Lett 19: 4504-8 (2009)
Article DOI: 10.1016/j.bmcl.2009.02.085
BindingDB Entry DOI: 10.7270/Q20Z7396
Prostaglandin G/H synthase 2
(Homo sapiens (Human))
BDBM50297669
(CHEMBL561891 | N-cyclohexyl-4-(4-(methylsulfonyl)p...)
Show SMILES CS(=O)(=O)c1ccc(cc1)-c1cc(nc(NC2CCCCC2)n1)C(F)(F)F
Show InChI InChI=1S/C18H20F3N3O2S/c1-27(25,26)14-9-7-12(8-10-14)15-11-16(18(19,20)21)24-17(23-15)22-13-5-3-2-4-6-13/h7-11,13H,2-6H2,1H3,(H,22,23,24)
NCI pathway
Reactome pathway
n/an/a 62n/an/an/an/an/an/a
GlaxoSmithKline
Curated by ChEMBL
Assay Description
Inhibition of COX2 in human whole blood assessed as inhibition of lipopolysaccharide-stimulated PGE2 production after 24 hrs by enzyme immunoassay
Bioorg Med Chem Lett 19: 4504-8 (2009)
Article DOI: 10.1016/j.bmcl.2009.02.085
BindingDB Entry DOI: 10.7270/Q20Z7396
Prostaglandin G/H synthase 1
(Homo sapiens (Human))
BDBM50297669
(CHEMBL561891 | N-cyclohexyl-4-(4-(methylsulfonyl)p...)
Show SMILES CS(=O)(=O)c1ccc(cc1)-c1cc(nc(NC2CCCCC2)n1)C(F)(F)F
Show InChI InChI=1S/C18H20F3N3O2S/c1-27(25,26)14-9-7-12(8-10-14)15-11-16(18(19,20)21)24-17(23-15)22-13-5-3-2-4-6-13/h7-11,13H,2-6H2,1H3,(H,22,23,24)
n/an/a>5.84E+4n/an/an/an/an/an/a
GlaxoSmithKline
Curated by ChEMBL
Assay Description
Inhibition of human COX1 expressed in african green monkey COS cells assessed as inhibition of arachidonic acid-stimulated PGE2 treated 1 hr before a...
Bioorg Med Chem Lett 19: 4504-8 (2009)
Article DOI: 10.1016/j.bmcl.2009.02.085
BindingDB Entry DOI: 10.7270/Q20Z7396
Prostaglandin G/H synthase 2
(Homo sapiens (Human))
BDBM50297669
(CHEMBL561891 | N-cyclohexyl-4-(4-(methylsulfonyl)p...)
Show SMILES CS(=O)(=O)c1ccc(cc1)-c1cc(nc(NC2CCCCC2)n1)C(F)(F)F
Show InChI InChI=1S/C18H20F3N3O2S/c1-27(25,26)14-9-7-12(8-10-14)15-11-16(18(19,20)21)24-17(23-15)22-13-5-3-2-4-6-13/h7-11,13H,2-6H2,1H3,(H,22,23,24)
NCI pathway
Reactome pathway
n/an/a 0.5n/an/an/an/an/an/a
GlaxoSmithKline
Curated by ChEMBL
Assay Description
Inhibition of human COX2 expressed in african green monkey COS cells assessed as inhibition of arachidonic acid-stimulated PGE2 production treated 1 ...
Bioorg Med Chem Lett 19: 4504-8 (2009)
Article DOI: 10.1016/j.bmcl.2009.02.085
BindingDB Entry DOI: 10.7270/Q20Z7396