null
SMILES: Cc1cccc(Oc2nc(cc(n2)C(F)(F)F)-c2ccc(cc2)S(C)(=O)=O)c1
InChI Key: InChIKey=PGNWEUVRLKVTHZ-UHFFFAOYSA-N
Activity Spreadsheet -- Enzyme Inhibition Constant Data from BindingDB
Found 2 hits for monomerid = 50297689
Trg + Lig
Ki
nM
ΔG°
kcal/mole
IC50
nM
Kd
nM
EC50/IC50
nM
koff
s-1
kon
M-1s-1
pHTemp
°C
Prostaglandin G/H synthase 2
(Homo sapiens (Human))
BDBM50297689
(4-(4-(methylsulfonyl)phenyl)-2-(m-tolyloxy)-6-(tri...)
Show SMILES Cc1cccc(Oc2nc(cc(n2)C(F)(F)F)-c2ccc(cc2)S(C)(=O)=O)c1
Show InChI InChI=1S/C19H15F3N2O3S/c1-12-4-3-5-14(10-12)27-18-23-16(11-17(24-18)19(20,21)22)13-6-8-15(9-7-13)28(2,25)26/h3-11H,1-2H3
NCI pathway
Reactome pathway
n/an/a<10n/an/an/an/an/an/a
GlaxoSmithKline
Curated by ChEMBL
Assay Description
Inhibition of human COX2 expressed in baculovirus-infected SF9 cells assessed as inhibition of arachidonic acid-stimulated PGE2 production treated 1 ...
Bioorg Med Chem Lett 19: 4504-8 (2009)
Article DOI: 10.1016/j.bmcl.2009.02.085
BindingDB Entry DOI: 10.7270/Q20Z7396
Prostaglandin G/H synthase 1
(Homo sapiens (Human))
BDBM50297689
(4-(4-(methylsulfonyl)phenyl)-2-(m-tolyloxy)-6-(tri...)
Show SMILES Cc1cccc(Oc2nc(cc(n2)C(F)(F)F)-c2ccc(cc2)S(C)(=O)=O)c1
Show InChI InChI=1S/C19H15F3N2O3S/c1-12-4-3-5-14(10-12)27-18-23-16(11-17(24-18)19(20,21)22)13-6-8-15(9-7-13)28(2,25)26/h3-11H,1-2H3
n/an/a 4.36E+3n/an/an/an/an/an/a
GlaxoSmithKline
Curated by ChEMBL
Assay Description
Inhibition of human COX1 expressed in baculovirus-infected SF9 cells assessed as inhibition of arachidonic acid-stimulated PGE2 production treated 1 ...
Bioorg Med Chem Lett 19: 4504-8 (2009)
Article DOI: 10.1016/j.bmcl.2009.02.085
BindingDB Entry DOI: 10.7270/Q20Z7396