null
SMILES: C[C@@H](Oc1cc(sc1C(N)=O)-c1cnc2ccccn12)c1ccccc1Cl
InChI Key: InChIKey=TXLCIUHAUUABEX-GFCCVEGCSA-N
Activity Spreadsheet -- Enzyme Inhibition Constant Data from BindingDB
Found 2 hits for monomerid = 50297962
Trg + Lig
Ki
nM
ΔG°
kcal/mole
IC50
nM
Kd
nM
EC50/IC50
nM
koff
s-1
kon
M-1s-1
pHTemp
°C
Serine/threonine-protein kinase PLK1
(Homo sapiens (Human))
BDBM50297962
((R)-3-(1-(2-chlorophenyl)ethoxy)-5-(imidazo[1,2-a]...)
Show SMILES C[C@@H](Oc1cc(sc1C(N)=O)-c1cnc2ccccn12)c1ccccc1Cl |r|
Show InChI InChI=1S/C20H16ClN3O2S/c1-12(13-6-2-3-7-14(13)21)26-16-10-17(27-19(16)20(22)25)15-11-23-18-8-4-5-9-24(15)18/h2-12H,1H3,(H2,22,25)/t12-/m1/s1
NCI pathway
Reactome pathway
n/an/a 7n/an/an/an/an/an/a
Banyu Tsukuba Research Institute
Curated by ChEMBL
Assay Description
Inhibition of PLK1
Bioorg Med Chem Lett 19: 4673-8 (2009)
Article DOI: 10.1016/j.bmcl.2009.06.084
BindingDB Entry DOI: 10.7270/Q22R3RQG
Serine/threonine-protein kinase PLK1
(Homo sapiens (Human))
BDBM50297962
((R)-3-(1-(2-chlorophenyl)ethoxy)-5-(imidazo[1,2-a]...)
Show SMILES C[C@@H](Oc1cc(sc1C(N)=O)-c1cnc2ccccn12)c1ccccc1Cl |r|
Show InChI InChI=1S/C20H16ClN3O2S/c1-12(13-6-2-3-7-14(13)21)26-16-10-17(27-19(16)20(22)25)15-11-23-18-8-4-5-9-24(15)18/h2-12H,1H3,(H2,22,25)/t12-/m1/s1
NCI pathway
Reactome pathway
n/an/an/an/a 310n/an/an/an/a
Banyu Tsukuba Research Institute
Curated by ChEMBL
Assay Description
Inhibition of PLK1-mediated mitosis in human HeLaS3 cells after 18 hrs
Bioorg Med Chem Lett 19: 4673-8 (2009)
Article DOI: 10.1016/j.bmcl.2009.06.084
BindingDB Entry DOI: 10.7270/Q22R3RQG