BDBM50297971 (R)-3-(1-(2-chloro-4-((cyclopropylamino)methyl)phenyl)ethoxy)-5-(imidazo[1,2-a]pyridin-3-yl)thiophene-2-carboxamide::CHEMBL561286
SMILES: C[C@@H](Oc1cc(sc1C(N)=O)-c1cnc2ccccn12)c1ccc(CNC2CC2)cc1Cl
InChI Key: InChIKey=AQPXGMDXSUVRHV-CQSZACIVSA-N
Data: 1 IC50  1 EC50
Activity Spreadsheet -- Enzyme Inhibition Constant Data from BindingDB
Found 2 hits for monomerid = 50297971
Trg + Lig
Ki
nM
ΔG°
kcal/mole
IC50
nM
Kd
nM
EC50/IC50
nM
koff
s-1
kon
M-1s-1
pHTemp
°C
Serine/threonine-protein kinase PLK1
(Homo sapiens (Human))
BDBM50297971
((R)-3-(1-(2-chloro-4-((cyclopropylamino)methyl)phe...)
Show SMILES C[C@@H](Oc1cc(sc1C(N)=O)-c1cnc2ccccn12)c1ccc(CNC2CC2)cc1Cl |r|
Show InChI InChI=1S/C24H23ClN4O2S/c1-14(17-8-5-15(10-18(17)25)12-27-16-6-7-16)31-20-11-21(32-23(20)24(26)30)19-13-28-22-4-2-3-9-29(19)22/h2-5,8-11,13-14,16,27H,6-7,12H2,1H3,(H2,26,30)/t14-/m1/s1
NCI pathway
Reactome pathway
n/an/a 12n/an/an/an/an/an/a
Banyu Tsukuba Research Institute
Curated by ChEMBL
Assay Description
Inhibition of PLK1
Bioorg Med Chem Lett 19: 4673-8 (2009)
Article DOI: 10.1016/j.bmcl.2009.06.084
BindingDB Entry DOI: 10.7270/Q22R3RQG
Serine/threonine-protein kinase PLK1
(Homo sapiens (Human))
BDBM50297971
((R)-3-(1-(2-chloro-4-((cyclopropylamino)methyl)phe...)
Show SMILES C[C@@H](Oc1cc(sc1C(N)=O)-c1cnc2ccccn12)c1ccc(CNC2CC2)cc1Cl |r|
Show InChI InChI=1S/C24H23ClN4O2S/c1-14(17-8-5-15(10-18(17)25)12-27-16-6-7-16)31-20-11-21(32-23(20)24(26)30)19-13-28-22-4-2-3-9-29(19)22/h2-5,8-11,13-14,16,27H,6-7,12H2,1H3,(H2,26,30)/t14-/m1/s1
NCI pathway
Reactome pathway
n/an/an/an/a 2.20E+5n/an/an/an/a
Banyu Tsukuba Research Institute
Curated by ChEMBL
Assay Description
Inhibition of PLK1-mediated mitosis in human HeLaS3 cells after 18 hrs
Bioorg Med Chem Lett 19: 4673-8 (2009)
Article DOI: 10.1016/j.bmcl.2009.06.084
BindingDB Entry DOI: 10.7270/Q22R3RQG