BDBM50298219 (R)-2-chloro-4-((1-methylpyrrolidin-3-yl)(2-(trifluoromethyl)benzyl)amino)benzonitrile::CHEMBL563341
SMILES: CN1CC[C@H](C1)N(Cc1ccccc1C(F)(F)F)c1ccc(C#N)c(Cl)c1
InChI Key: InChIKey=HMOAZJHSXXENHE-QGZVFWFLSA-N
Data: 3 IC50  1 EC50
Activity Spreadsheet -- Enzyme Inhibition Constant Data from BindingDB
Found 4 hits for monomerid = 50298219
Trg + Lig
Ki
nM
ΔG°
kcal/mole
IC50
nM
Kd
nM
EC50/IC50
nM
koff
s-1
kon
M-1s-1
pHTemp
°C
Potassium voltage-gated channel subfamily H member 2
(Homo sapiens (Human))
BDBM50298219
((R)-2-chloro-4-((1-methylpyrrolidin-3-yl)(2-(trifl...)
Show SMILES CN1CC[C@H](C1)N(Cc1ccccc1C(F)(F)F)c1ccc(C#N)c(Cl)c1 |r|
Show InChI InChI=1S/C20H19ClF3N3/c1-26-9-8-17(13-26)27(16-7-6-14(11-25)19(21)10-16)12-15-4-2-3-5-18(15)20(22,23)24/h2-7,10,17H,8-9,12-13H2,1H3/t17-/m1/s1
Reactome pathway
n/an/a 780n/an/an/an/an/an/a
GlaxoSmithKline Pharmaceuticals
Curated by ChEMBL
Assay Description
Inhibition of human ERG by whole cell patch clamp assay
Bioorg Med Chem Lett 19: 4664-8 (2009)
Article DOI: 10.1016/j.bmcl.2009.06.081
BindingDB Entry DOI: 10.7270/Q25H7G9T
Progesterone receptor
(Homo sapiens (Human))
BDBM50298219
((R)-2-chloro-4-((1-methylpyrrolidin-3-yl)(2-(trifl...)
Show SMILES CN1CC[C@H](C1)N(Cc1ccccc1C(F)(F)F)c1ccc(C#N)c(Cl)c1 |r|
Show InChI InChI=1S/C20H19ClF3N3/c1-26-9-8-17(13-26)27(16-7-6-14(11-25)19(21)10-16)12-15-4-2-3-5-18(15)20(22,23)24/h2-7,10,17H,8-9,12-13H2,1H3/t17-/m1/s1
n/an/an/an/a 30n/an/an/an/a
GlaxoSmithKline Pharmaceuticals
Curated by ChEMBL
Assay Description
Agonist activity at progesterone receptor in human T47D cells assessed as inhibition of progesterone-induced alkaline phosphatase activity
Bioorg Med Chem Lett 19: 4664-8 (2009)
Article DOI: 10.1016/j.bmcl.2009.06.081
BindingDB Entry DOI: 10.7270/Q25H7G9T
Progesterone receptor
(Homo sapiens (Human))
BDBM50298219
((R)-2-chloro-4-((1-methylpyrrolidin-3-yl)(2-(trifl...)
Show SMILES CN1CC[C@H](C1)N(Cc1ccccc1C(F)(F)F)c1ccc(C#N)c(Cl)c1 |r|
Show InChI InChI=1S/C20H19ClF3N3/c1-26-9-8-17(13-26)27(16-7-6-14(11-25)19(21)10-16)12-15-4-2-3-5-18(15)20(22,23)24/h2-7,10,17H,8-9,12-13H2,1H3/t17-/m1/s1
n/an/a 15n/an/an/an/an/an/a
GlaxoSmithKline Pharmaceuticals
Curated by ChEMBL
Assay Description
Binding affinity to progesterone receptor
Bioorg Med Chem Lett 19: 4664-8 (2009)
Article DOI: 10.1016/j.bmcl.2009.06.081
BindingDB Entry DOI: 10.7270/Q25H7G9T
Androgen Receptor
(Homo sapiens (Human))
BDBM50298219
((R)-2-chloro-4-((1-methylpyrrolidin-3-yl)(2-(trifl...)
Show SMILES CN1CC[C@H](C1)N(Cc1ccccc1C(F)(F)F)c1ccc(C#N)c(Cl)c1 |r|
Show InChI InChI=1S/C20H19ClF3N3/c1-26-9-8-17(13-26)27(16-7-6-14(11-25)19(21)10-16)12-15-4-2-3-5-18(15)20(22,23)24/h2-7,10,17H,8-9,12-13H2,1H3/t17-/m1/s1
NCI pathway
Reactome pathway
n/an/a 250n/an/an/an/an/an/a
GlaxoSmithKline Pharmaceuticals
Curated by ChEMBL
Assay Description
Binding affinity to androgen receptor
Bioorg Med Chem Lett 19: 4664-8 (2009)
Article DOI: 10.1016/j.bmcl.2009.06.081
BindingDB Entry DOI: 10.7270/Q25H7G9T