null
SMILES: C\C(COCc1cccc(c1)C(=O)c1ccccc1)=C/COP(O)(=O)OP(O)(O)=O
InChI Key: InChIKey=FRRDOMJIBSXIKE-XNTDXEJSSA-N
Activity Spreadsheet -- Enzyme Inhibition Constant Data from BindingDB
Found 2 hits for monomerid = 50298242
Trg + Lig
Ki
nM
ΔG°
kcal/mole
IC50
nM
Kd
nM
EC50/IC50
nM
koff
s-1
kon
M-1s-1
pHTemp
°C
Protein farnesyltransferase/geranylgeranyltransferase type-1 subunit alpha
(Saccharomyces cerevisiae)
BDBM50298242
((E)-4-(3-benzoylbenzyloxy)-3-methylbut-2-enyl diph...)
Show SMILES C\C(COCc1cccc(c1)C(=O)c1ccccc1)=C/COP(O)(=O)OP(O)(O)=O
Show InChI InChI=1S/C19H22O9P2/c1-15(10-11-27-30(24,25)28-29(21,22)23)13-26-14-16-6-5-9-18(12-16)19(20)17-7-3-2-4-8-17/h2-10,12H,11,13-14H2,1H3,(H,24,25)(H2,21,22,23)/b15-10+
610n/an/an/an/an/an/an/an/a
University of Minnesota
Curated by ChEMBL
Assay Description
Inhibition of Saccharomyces cerevisiae protein farnesyltransferase assessed as farnsylation of N-dansyl-GCVIA
Bioorg Med Chem 17: 4797-805 (2009)
Article DOI: 10.1016/j.bmc.2009.04.034
BindingDB Entry DOI: 10.7270/Q2HT2PCH
Protein farnesyltransferase/geranylgeranyltransferase type-1 subunit alpha
(Saccharomyces cerevisiae)
BDBM50298242
((E)-4-(3-benzoylbenzyloxy)-3-methylbut-2-enyl diph...)
Show SMILES C\C(COCc1cccc(c1)C(=O)c1ccccc1)=C/COP(O)(=O)OP(O)(O)=O
Show InChI InChI=1S/C19H22O9P2/c1-15(10-11-27-30(24,25)28-29(21,22)23)13-26-14-16-6-5-9-18(12-16)19(20)17-7-3-2-4-8-17/h2-10,12H,11,13-14H2,1H3,(H,24,25)(H2,21,22,23)/b15-10+
n/an/a 3.40E+3n/an/an/an/an/an/a
University of Minnesota
Curated by ChEMBL
Assay Description
Inhibition of Saccharomyces cerevisiae protein farnesyltransferase assessed as farnsylation of N-dansyl-GCVIA
Bioorg Med Chem 17: 4797-805 (2009)
Article DOI: 10.1016/j.bmc.2009.04.034
BindingDB Entry DOI: 10.7270/Q2HT2PCH