BDBM50298591 (+/-)-2-(2-(6-fluoro-1H-indole-2-carboxamido)benzamido)-3-phenylpropanoic acid::CHEMBL577161
SMILES: OC(=O)C(Cc1ccccc1)NC(=O)c1ccccc1NC(=O)c1cc2ccc(F)cc2[nH]1
InChI Key: InChIKey=SWCUCLJSJIARIJ-UHFFFAOYSA-N
Data: 1 IC50
Activity Spreadsheet -- Enzyme Inhibition Constant Data from BindingDB
Found 1 hit for monomerid = 50298591
Trg + Lig
Ki
nM
ΔG°
kcal/mole
IC50
nM
Kd
nM
EC50/IC50
nM
koff
s-1
kon
M-1s-1
pHTemp
°C
Cholecystokinin receptor
(RAT)
BDBM50298591
((+/-)-2-(2-(6-fluoro-1H-indole-2-carboxamido)benza...)
Show SMILES OC(=O)C(Cc1ccccc1)NC(=O)c1ccccc1NC(=O)c1cc2ccc(F)cc2[nH]1
Show InChI InChI=1S/C25H20FN3O4/c26-17-11-10-16-13-21(27-20(16)14-17)24(31)28-19-9-5-4-8-18(19)23(30)29-22(25(32)33)12-15-6-2-1-3-7-15/h1-11,13-14,22,27H,12H2,(H,28,31)(H,29,30)(H,32,33)
Reactome pathway
n/an/a 294n/an/an/an/an/an/a
Aristotelian University of Thessaloniki
Curated by ChEMBL
Assay Description
Displacement of [125I]-CCK8 from CCK1 receptor in rat pancreatic acinar cells
Bioorg Med Chem 17: 5198-206 (2009)
Article DOI: 10.1016/j.bmc.2009.05.067
BindingDB Entry DOI: 10.7270/Q2QC03JB