null
SMILES: CS(=O)(=O)N1CC2(CCN(CC2)C(=O)Nc2ccc(cc2)C(=O)c2ccccc2)c2ccccc12
InChI Key: InChIKey=ZLYAPBVISZMDLM-UHFFFAOYSA-N
Activity Spreadsheet -- Enzyme Inhibition Constant Data from BindingDB
Found 1 hit for monomerid = 50298636
Trg + Lig
Ki
nM
ΔG°
kcal/mole
IC50
nM
Kd
nM
EC50/IC50
nM
koff
s-1
kon
M-1s-1
pHTemp
°C
Neuropeptide Y receptor type 5
(Homo sapiens (Human))
BDBM50298636
(1-(Methylsulfonyl)-N-[4-(phenylcarbonyl)phenyl]-1,...)
Show SMILES CS(=O)(=O)N1CC2(CCN(CC2)C(=O)Nc2ccc(cc2)C(=O)c2ccccc2)c2ccccc12
Show InChI InChI=1S/C27H27N3O4S/c1-35(33,34)30-19-27(23-9-5-6-10-24(23)30)15-17-29(18-16-27)26(32)28-22-13-11-21(12-14-22)25(31)20-7-3-2-4-8-20/h2-14H,15-19H2,1H3,(H,28,32)
n/an/a 0.680n/an/an/an/an/an/a
Tsukuba Research Institute
Curated by ChEMBL
Assay Description
Binding affinity to human neuropeptide Y5 receptor
Bioorg Med Chem 17: 5015-26 (2009)
Article DOI: 10.1016/j.bmc.2009.05.064
BindingDB Entry DOI: 10.7270/Q2KK9BT2