BDBM50299052 CHEMBL584365::N-Hydroxy-2-[2-(4'-methoxy-biphenyl-4-sulfonyl)phenyl]acetamide
SMILES: COc1ccc(cc1)-c1ccc(cc1)S(=O)(=O)c1ccccc1CC(=O)NO
InChI Key: InChIKey=DJZNIZCARKSSDE-UHFFFAOYSA-N
Data: 14 IC50
PDB links: 1 PDB ID matches this monomer.
Activity Spreadsheet -- Enzyme Inhibition Constant Data from BindingDB
Found 14 hits for monomerid = 50299052
Trg + Lig
Ki
nM
ΔG°
kcal/mole
IC50
nM
Kd
nM
EC50/IC50
nM
koff
s-1
kon
M-1s-1
pHTemp
°C
Matrix metalloproteinase-9
(Homo sapiens (Human))
BDBM50299052
(CHEMBL584365 | N-Hydroxy-2-[2-(4'-methoxy-biphenyl...)
Show SMILES COc1ccc(cc1)-c1ccc(cc1)S(=O)(=O)c1ccccc1CC(=O)NO
Show InChI InChI=1S/C21H19NO5S/c1-27-18-10-6-15(7-11-18)16-8-12-19(13-9-16)28(25,26)20-5-3-2-4-17(20)14-21(23)22-24/h2-13,24H,14H2,1H3,(H,22,23)
Reactome pathway
n/an/a 94n/an/an/an/an/an/a
Universit£ di Pisa
Curated by ChEMBL
Assay Description
Inhibition of para-aminophenylmercuric acetate-activated human recombinant pro-MMP9 catalytic domain after 4 hrs by fluorimetry
J Med Chem 52: 6347-61 (2009)
Article DOI: 10.1021/jm900335a
BindingDB Entry DOI: 10.7270/Q2HQ3ZZS
Matrix metalloproteinase-14 (MMP14)
(Homo sapiens (Human))
BDBM50299052
(CHEMBL584365 | N-Hydroxy-2-[2-(4'-methoxy-biphenyl...)
Show SMILES COc1ccc(cc1)-c1ccc(cc1)S(=O)(=O)c1ccccc1CC(=O)NO
Show InChI InChI=1S/C21H19NO5S/c1-27-18-10-6-15(7-11-18)16-8-12-19(13-9-16)28(25,26)20-5-3-2-4-17(20)14-21(23)22-24/h2-13,24H,14H2,1H3,(H,22,23)
n/an/a 710n/an/an/an/an/an/a
Universit£ di Pisa
Curated by ChEMBL
Assay Description
Inhibition of human recombinant pro-MMP14 catalytic domain after 4 hrs by fluorimetry
J Med Chem 52: 6347-61 (2009)
Article DOI: 10.1021/jm900335a
BindingDB Entry DOI: 10.7270/Q2HQ3ZZS
Collagenase 3
(Homo sapiens (Human))
BDBM50299052
(CHEMBL584365 | N-Hydroxy-2-[2-(4'-methoxy-biphenyl...)
Show SMILES COc1ccc(cc1)-c1ccc(cc1)S(=O)(=O)c1ccccc1CC(=O)NO
Show InChI InChI=1S/C21H19NO5S/c1-27-18-10-6-15(7-11-18)16-8-12-19(13-9-16)28(25,26)20-5-3-2-4-17(20)14-21(23)22-24/h2-13,24H,14H2,1H3,(H,22,23)
NCI pathway
Reactome pathway
n/an/a 25n/an/an/an/an/an/a
Universit£ di Pisa
Curated by ChEMBL
Assay Description
Inhibition of para-aminophenylmercuric acetate-activated human pro-MMP13 after 4 hrs by fluorimetry
J Med Chem 52: 6347-61 (2009)
Article DOI: 10.1021/jm900335a
BindingDB Entry DOI: 10.7270/Q2HQ3ZZS
Matrix metalloproteinase-12 (MMP12)
(Homo sapiens (Human))
BDBM50299052
(CHEMBL584365 | N-Hydroxy-2-[2-(4'-methoxy-biphenyl...)
Show SMILES COc1ccc(cc1)-c1ccc(cc1)S(=O)(=O)c1ccccc1CC(=O)NO
Show InChI InChI=1S/C21H19NO5S/c1-27-18-10-6-15(7-11-18)16-8-12-19(13-9-16)28(25,26)20-5-3-2-4-17(20)14-21(23)22-24/h2-13,24H,14H2,1H3,(H,22,23)
Reactome pathway
n/an/a 4.80n/an/an/an/an/an/a
Universit£ di Pisa
Curated by ChEMBL
Assay Description
Inhibition of autoactivated human pro-MMP12 after 4 hrs by fluorimetry
J Med Chem 52: 6347-61 (2009)
Article DOI: 10.1021/jm900335a
BindingDB Entry DOI: 10.7270/Q2HQ3ZZS
3D
3D Structure (crystal)
72 kDa type IV collagenase
(Homo sapiens (Human))
BDBM50299052
(CHEMBL584365 | N-Hydroxy-2-[2-(4'-methoxy-biphenyl...)
Show SMILES COc1ccc(cc1)-c1ccc(cc1)S(=O)(=O)c1ccccc1CC(=O)NO
Show InChI InChI=1S/C21H19NO5S/c1-27-18-10-6-15(7-11-18)16-8-12-19(13-9-16)28(25,26)20-5-3-2-4-17(20)14-21(23)22-24/h2-13,24H,14H2,1H3,(H,22,23)
Reactome pathway
n/an/a 9.70n/an/an/an/an/an/a
Universit£ di Pisa
Curated by ChEMBL
Assay Description
Inhibition of para-aminophenylmercuric acetate-activated human recombinant pro-MMP2 catalytic domain after 4 hrs by fluorimetry
J Med Chem 52: 6347-61 (2009)
Article DOI: 10.1021/jm900335a
BindingDB Entry DOI: 10.7270/Q2HQ3ZZS
Neutrophil collagenase
(Homo sapiens (Human))
BDBM50299052
(CHEMBL584365 | N-Hydroxy-2-[2-(4'-methoxy-biphenyl...)
Show SMILES COc1ccc(cc1)-c1ccc(cc1)S(=O)(=O)c1ccccc1CC(=O)NO
Show InChI InChI=1S/C21H19NO5S/c1-27-18-10-6-15(7-11-18)16-8-12-19(13-9-16)28(25,26)20-5-3-2-4-17(20)14-21(23)22-24/h2-13,24H,14H2,1H3,(H,22,23)
Reactome pathway
n/an/a 120n/an/an/an/an/an/a
Universit£ di Pisa
Curated by ChEMBL
Assay Description
Inhibition of para-aminophenylmercuric acetate-activated human pro-MMP8 after 4 hrs by fluorimetry
J Med Chem 52: 6347-61 (2009)
Article DOI: 10.1021/jm900335a
BindingDB Entry DOI: 10.7270/Q2HQ3ZZS
Matrix metalloproteinase-9
(Homo sapiens (Human))
BDBM50299052
(CHEMBL584365 | N-Hydroxy-2-[2-(4'-methoxy-biphenyl...)
Show SMILES COc1ccc(cc1)-c1ccc(cc1)S(=O)(=O)c1ccccc1CC(=O)NO
Show InChI InChI=1S/C21H19NO5S/c1-27-18-10-6-15(7-11-18)16-8-12-19(13-9-16)28(25,26)20-5-3-2-4-17(20)14-21(23)22-24/h2-13,24H,14H2,1H3,(H,22,23)
Reactome pathway
n/an/a 94n/an/an/an/an/an/a
Universit£ di Pisa
Curated by ChEMBL
Assay Description
Inhibition of recombinant human MMP-9 using Mca-Lys-Pro-Leu-Gly-Leu-Dap(Dnp)-Ala-Arg-NH2 as substrate preincubated for 3 hrs followed by substrate ad...
J Med Chem 61: 4421-4435 (2018)
Article DOI: 10.1021/acs.jmedchem.8b00096
BindingDB Entry DOI: 10.7270/Q26H4M12
Stromelysin-1
(Homo sapiens (Human))
BDBM50299052
(CHEMBL584365 | N-Hydroxy-2-[2-(4'-methoxy-biphenyl...)
Show SMILES COc1ccc(cc1)-c1ccc(cc1)S(=O)(=O)c1ccccc1CC(=O)NO
Show InChI InChI=1S/C21H19NO5S/c1-27-18-10-6-15(7-11-18)16-8-12-19(13-9-16)28(25,26)20-5-3-2-4-17(20)14-21(23)22-24/h2-13,24H,14H2,1H3,(H,22,23)
Reactome pathway
n/an/a 1.60E+3n/an/an/an/an/an/a
Universit£ di Pisa
Curated by ChEMBL
Assay Description
Inhibition of trypsin activated human pro-MMP3 after 4 hrs by fluorimetry
J Med Chem 52: 6347-61 (2009)
Article DOI: 10.1021/jm900335a
BindingDB Entry DOI: 10.7270/Q2HQ3ZZS
Interstitial collagenase
(Homo sapiens (Human))
BDBM50299052
(CHEMBL584365 | N-Hydroxy-2-[2-(4'-methoxy-biphenyl...)
Show SMILES COc1ccc(cc1)-c1ccc(cc1)S(=O)(=O)c1ccccc1CC(=O)NO
Show InChI InChI=1S/C21H19NO5S/c1-27-18-10-6-15(7-11-18)16-8-12-19(13-9-16)28(25,26)20-5-3-2-4-17(20)14-21(23)22-24/h2-13,24H,14H2,1H3,(H,22,23)
Reactome pathway
n/an/a 8.30E+3n/an/an/an/an/an/a
Universit£ di Pisa
Curated by ChEMBL
Assay Description
Inhibition of para-aminophenylmercuric acetate-activated human pro-MMP1 after 4 hrs by fluorimetry
J Med Chem 52: 6347-61 (2009)
Article DOI: 10.1021/jm900335a
BindingDB Entry DOI: 10.7270/Q2HQ3ZZS
72 kDa type IV collagenase
(Homo sapiens (Human))
BDBM50299052
(CHEMBL584365 | N-Hydroxy-2-[2-(4'-methoxy-biphenyl...)
Show SMILES COc1ccc(cc1)-c1ccc(cc1)S(=O)(=O)c1ccccc1CC(=O)NO
Show InChI InChI=1S/C21H19NO5S/c1-27-18-10-6-15(7-11-18)16-8-12-19(13-9-16)28(25,26)20-5-3-2-4-17(20)14-21(23)22-24/h2-13,24H,14H2,1H3,(H,22,23)
Reactome pathway
n/an/a 9.70n/an/an/an/an/an/a
Universit£ di Pisa
Curated by ChEMBL
Assay Description
Inhibition of recombinant human MMP-2 using Mca-Lys-Pro-Leu-Gly-Leu-Dap(Dnp)-Ala-Arg-NH2 as substrate preincubated for 3 hrs followed by substrate ad...
J Med Chem 61: 4421-4435 (2018)
Article DOI: 10.1021/acs.jmedchem.8b00096
BindingDB Entry DOI: 10.7270/Q26H4M12
Matrix metalloproteinase 12
(Homo sapiens (Human))
BDBM50299052
(CHEMBL584365 | N-Hydroxy-2-[2-(4'-methoxy-biphenyl...)
Show SMILES COc1ccc(cc1)-c1ccc(cc1)S(=O)(=O)c1ccccc1CC(=O)NO
Show InChI InChI=1S/C21H19NO5S/c1-27-18-10-6-15(7-11-18)16-8-12-19(13-9-16)28(25,26)20-5-3-2-4-17(20)14-21(23)22-24/h2-13,24H,14H2,1H3,(H,22,23)
Reactome pathway
n/an/a 4.80n/an/an/an/an/an/a
Universit£ di Pisa
Curated by ChEMBL
Assay Description
Inhibition of recombinant human MMP-12 using Mca-Lys-Pro-Leu-Gly-Leu-Dap(Dnp)-Ala-Arg-NH2 as substrate preincubated for 3 hrs followed by substrate a...
J Med Chem 61: 4421-4435 (2018)
Article DOI: 10.1021/acs.jmedchem.8b00096
BindingDB Entry DOI: 10.7270/Q26H4M12
3D
3D Structure (crystal)
Interstitial collagenase
(Homo sapiens (Human))
BDBM50299052
(CHEMBL584365 | N-Hydroxy-2-[2-(4'-methoxy-biphenyl...)
Show SMILES COc1ccc(cc1)-c1ccc(cc1)S(=O)(=O)c1ccccc1CC(=O)NO
Show InChI InChI=1S/C21H19NO5S/c1-27-18-10-6-15(7-11-18)16-8-12-19(13-9-16)28(25,26)20-5-3-2-4-17(20)14-21(23)22-24/h2-13,24H,14H2,1H3,(H,22,23)
Reactome pathway
n/an/a 8.30E+3n/an/an/an/an/an/a
Universit£ di Pisa
Curated by ChEMBL
Assay Description
Inhibition of recombinant human MMP-1 using Mca-Lys-Pro-Leu-Gly-Leu-Dap(Dnp)-Ala-Arg-NH2 as substrate preincubated for 3 hrs followed by substrate ad...
J Med Chem 61: 4421-4435 (2018)
Article DOI: 10.1021/acs.jmedchem.8b00096
BindingDB Entry DOI: 10.7270/Q26H4M12
Matrix metalloproteinase 14
(Homo sapiens (Human))
BDBM50299052
(CHEMBL584365 | N-Hydroxy-2-[2-(4'-methoxy-biphenyl...)
Show SMILES COc1ccc(cc1)-c1ccc(cc1)S(=O)(=O)c1ccccc1CC(=O)NO
Show InChI InChI=1S/C21H19NO5S/c1-27-18-10-6-15(7-11-18)16-8-12-19(13-9-16)28(25,26)20-5-3-2-4-17(20)14-21(23)22-24/h2-13,24H,14H2,1H3,(H,22,23)
n/an/a 710n/an/an/an/an/an/a
Universit£ di Pisa
Curated by ChEMBL
Assay Description
Inhibition of recombinant human MMP-14 catalytic domain using Mca-Lys-Pro-Leu-Gly-Leu-Dap(Dnp)-Ala-Arg-NH2 as substrate preincubated for 3 hrs follow...
J Med Chem 61: 4421-4435 (2018)
Article DOI: 10.1021/acs.jmedchem.8b00096
BindingDB Entry DOI: 10.7270/Q26H4M12
Matrix metalloproteinase 16
(Homo sapiens (Human))
BDBM50299052
(CHEMBL584365 | N-Hydroxy-2-[2-(4'-methoxy-biphenyl...)
Show SMILES COc1ccc(cc1)-c1ccc(cc1)S(=O)(=O)c1ccccc1CC(=O)NO
Show InChI InChI=1S/C21H19NO5S/c1-27-18-10-6-15(7-11-18)16-8-12-19(13-9-16)28(25,26)20-5-3-2-4-17(20)14-21(23)22-24/h2-13,24H,14H2,1H3,(H,22,23)
Reactome pathway
n/an/a 130n/an/an/an/an/an/a
Universit£ di Pisa
Curated by ChEMBL
Assay Description
Inhibition of human recombinant pro-MMP16 catalytic domain after 4 hrs by fluorimetry
J Med Chem 52: 6347-61 (2009)
Article DOI: 10.1021/jm900335a
BindingDB Entry DOI: 10.7270/Q2HQ3ZZS