BDBM50299062 CHEMBL579067::{2-[4-(4-Methoxy-phenoxy)benzenesulfonyl]phenyl}acetic Acid
SMILES: COc1ccc(Oc2ccc(cc2)S(=O)(=O)c2ccccc2CC(O)=O)cc1
InChI Key: InChIKey=YMAXKJGQKQACFZ-UHFFFAOYSA-N
Data: 9 IC50
Activity Spreadsheet -- Enzyme Inhibition Constant Data from BindingDB
Found 9 hits for monomerid = 50299062
Trg + Lig
Ki
nM
ΔG°
kcal/mole
IC50
nM
Kd
nM
EC50/IC50
nM
koff
s-1
kon
M-1s-1
pHTemp
°C
Matrix metalloproteinase-9
(Homo sapiens (Human))
BDBM50299062
(CHEMBL579067 | {2-[4-(4-Methoxy-phenoxy)benzenesul...)
Show SMILES COc1ccc(Oc2ccc(cc2)S(=O)(=O)c2ccccc2CC(O)=O)cc1
Show InChI InChI=1S/C21H18O6S/c1-26-16-6-8-17(9-7-16)27-18-10-12-19(13-11-18)28(24,25)20-5-3-2-4-15(20)14-21(22)23/h2-13H,14H2,1H3,(H,22,23)
Reactome pathway
n/an/a 420n/an/an/an/an/an/a
Universit£ di Pisa
Curated by ChEMBL
Assay Description
Inhibition of para-aminophenylmercuric acetate-activated human recombinant pro-MMP9 catalytic domain after 4 hrs by fluorimetry
J Med Chem 52: 6347-61 (2009)
Article DOI: 10.1021/jm900335a
BindingDB Entry DOI: 10.7270/Q2HQ3ZZS
Matrix metalloproteinase-14
(Homo sapiens (Human))
BDBM50299062
(CHEMBL579067 | {2-[4-(4-Methoxy-phenoxy)benzenesul...)
Show SMILES COc1ccc(Oc2ccc(cc2)S(=O)(=O)c2ccccc2CC(O)=O)cc1
Show InChI InChI=1S/C21H18O6S/c1-26-16-6-8-17(9-7-16)27-18-10-12-19(13-11-18)28(24,25)20-5-3-2-4-15(20)14-21(22)23/h2-13H,14H2,1H3,(H,22,23)
n/an/a 8.10E+3n/an/an/an/an/an/a
Universit£ di Pisa
Curated by ChEMBL
Assay Description
Inhibition of human recombinant pro-MMP14 catalytic domain after 4 hrs by fluorimetry
J Med Chem 52: 6347-61 (2009)
Article DOI: 10.1021/jm900335a
BindingDB Entry DOI: 10.7270/Q2HQ3ZZS
Macrophage metalloelastase
(Homo sapiens (Human))
BDBM50299062
(CHEMBL579067 | {2-[4-(4-Methoxy-phenoxy)benzenesul...)
Show SMILES COc1ccc(Oc2ccc(cc2)S(=O)(=O)c2ccccc2CC(O)=O)cc1
Show InChI InChI=1S/C21H18O6S/c1-26-16-6-8-17(9-7-16)27-18-10-12-19(13-11-18)28(24,25)20-5-3-2-4-15(20)14-21(22)23/h2-13H,14H2,1H3,(H,22,23)
Reactome pathway
n/an/a 380n/an/an/an/an/an/a
Universit£ di Pisa
Curated by ChEMBL
Assay Description
Inhibition of autoactivated human pro-MMP12 after 4 hrs by fluorimetry
J Med Chem 52: 6347-61 (2009)
Article DOI: 10.1021/jm900335a
BindingDB Entry DOI: 10.7270/Q2HQ3ZZS
72 kDa type IV collagenase
(Homo sapiens (Human))
BDBM50299062
(CHEMBL579067 | {2-[4-(4-Methoxy-phenoxy)benzenesul...)
Show SMILES COc1ccc(Oc2ccc(cc2)S(=O)(=O)c2ccccc2CC(O)=O)cc1
Show InChI InChI=1S/C21H18O6S/c1-26-16-6-8-17(9-7-16)27-18-10-12-19(13-11-18)28(24,25)20-5-3-2-4-15(20)14-21(22)23/h2-13H,14H2,1H3,(H,22,23)
Reactome pathway
n/an/a 710n/an/an/an/an/an/a
Universit£ di Pisa
Curated by ChEMBL
Assay Description
Inhibition of para-aminophenylmercuric acetate-activated human recombinant pro-MMP2 catalytic domain after 4 hrs by fluorimetry
J Med Chem 52: 6347-61 (2009)
Article DOI: 10.1021/jm900335a
BindingDB Entry DOI: 10.7270/Q2HQ3ZZS
Stromelysin-1
(Homo sapiens (Human))
BDBM50299062
(CHEMBL579067 | {2-[4-(4-Methoxy-phenoxy)benzenesul...)
Show SMILES COc1ccc(Oc2ccc(cc2)S(=O)(=O)c2ccccc2CC(O)=O)cc1
Show InChI InChI=1S/C21H18O6S/c1-26-16-6-8-17(9-7-16)27-18-10-12-19(13-11-18)28(24,25)20-5-3-2-4-15(20)14-21(22)23/h2-13H,14H2,1H3,(H,22,23)
Reactome pathway
n/an/a>1.00E+4n/an/an/an/an/an/a
Universit£ di Pisa
Curated by ChEMBL
Assay Description
Inhibition of trypsin activated human pro-MMP3 after 4 hrs by fluorimetry
J Med Chem 52: 6347-61 (2009)
Article DOI: 10.1021/jm900335a
BindingDB Entry DOI: 10.7270/Q2HQ3ZZS
Neutrophil collagenase
(Homo sapiens (Human))
BDBM50299062
(CHEMBL579067 | {2-[4-(4-Methoxy-phenoxy)benzenesul...)
Show SMILES COc1ccc(Oc2ccc(cc2)S(=O)(=O)c2ccccc2CC(O)=O)cc1
Show InChI InChI=1S/C21H18O6S/c1-26-16-6-8-17(9-7-16)27-18-10-12-19(13-11-18)28(24,25)20-5-3-2-4-15(20)14-21(22)23/h2-13H,14H2,1H3,(H,22,23)
Reactome pathway
n/an/a 1.20E+3n/an/an/an/an/an/a
Universit£ di Pisa
Curated by ChEMBL
Assay Description
Inhibition of para-aminophenylmercuric acetate-activated human pro-MMP8 after 4 hrs by fluorimetry
J Med Chem 52: 6347-61 (2009)
Article DOI: 10.1021/jm900335a
BindingDB Entry DOI: 10.7270/Q2HQ3ZZS
Matrix metalloproteinase-16
(Homo sapiens (Human))
BDBM50299062
(CHEMBL579067 | {2-[4-(4-Methoxy-phenoxy)benzenesul...)
Show SMILES COc1ccc(Oc2ccc(cc2)S(=O)(=O)c2ccccc2CC(O)=O)cc1
Show InChI InChI=1S/C21H18O6S/c1-26-16-6-8-17(9-7-16)27-18-10-12-19(13-11-18)28(24,25)20-5-3-2-4-15(20)14-21(22)23/h2-13H,14H2,1H3,(H,22,23)
Reactome pathway
n/an/a 6.50E+3n/an/an/an/an/an/a
Universit£ di Pisa
Curated by ChEMBL
Assay Description
Inhibition of human recombinant pro-MMP16 catalytic domain after 4 hrs by fluorimetry
J Med Chem 52: 6347-61 (2009)
Article DOI: 10.1021/jm900335a
BindingDB Entry DOI: 10.7270/Q2HQ3ZZS
Interstitial collagenase
(Homo sapiens (Human))
BDBM50299062
(CHEMBL579067 | {2-[4-(4-Methoxy-phenoxy)benzenesul...)
Show SMILES COc1ccc(Oc2ccc(cc2)S(=O)(=O)c2ccccc2CC(O)=O)cc1
Show InChI InChI=1S/C21H18O6S/c1-26-16-6-8-17(9-7-16)27-18-10-12-19(13-11-18)28(24,25)20-5-3-2-4-15(20)14-21(22)23/h2-13H,14H2,1H3,(H,22,23)
Reactome pathway
n/an/a>1.00E+4n/an/an/an/an/an/a
Universit£ di Pisa
Curated by ChEMBL
Assay Description
Inhibition of para-aminophenylmercuric acetate-activated human pro-MMP1 after 4 hrs by fluorimetry
J Med Chem 52: 6347-61 (2009)
Article DOI: 10.1021/jm900335a
BindingDB Entry DOI: 10.7270/Q2HQ3ZZS
Collagenase 3
(Homo sapiens (Human))
BDBM50299062
(CHEMBL579067 | {2-[4-(4-Methoxy-phenoxy)benzenesul...)
Show SMILES COc1ccc(Oc2ccc(cc2)S(=O)(=O)c2ccccc2CC(O)=O)cc1
Show InChI InChI=1S/C21H18O6S/c1-26-16-6-8-17(9-7-16)27-18-10-12-19(13-11-18)28(24,25)20-5-3-2-4-15(20)14-21(22)23/h2-13H,14H2,1H3,(H,22,23)
NCI pathway
Reactome pathway
n/an/a 940n/an/an/an/an/an/a
Universit£ di Pisa
Curated by ChEMBL
Assay Description
Inhibition of para-aminophenylmercuric acetate-activated human pro-MMP13 after 4 hrs by fluorimetry
J Med Chem 52: 6347-61 (2009)
Article DOI: 10.1021/jm900335a
BindingDB Entry DOI: 10.7270/Q2HQ3ZZS