BDBM50299071 5-(5-Methyl-1,3,4-oxadiazol-2-yl)-3-[4-(methylsulfinyl)phenyl]furo[2,3-c]pyridine::CHEMBL578634
SMILES: Cc1ccc(o1)-c1cc2c(coc2cn1)-c1ccc(cc1)S(C)=O
InChI Key: InChIKey=QMCQYQXFDHUKGW-UHFFFAOYSA-N
Data: 1 IC50
Activity Spreadsheet -- Enzyme Inhibition Constant Data from BindingDB
Found 1 hit for monomerid = 50299071
Trg + Lig
Ki
nM
ΔG°
kcal/mole
IC50
nM
Kd
nM
EC50/IC50
nM
koff
s-1
kon
M-1s-1
pHTemp
°C
Glycogen synthase kinase-3 beta
(Homo sapiens (Human))
BDBM50299071
(5-(5-Methyl-1,3,4-oxadiazol-2-yl)-3-[4-(methylsulf...)
Show SMILES Cc1ccc(o1)-c1cc2c(coc2cn1)-c1ccc(cc1)S(C)=O
Show InChI InChI=1S/C19H15NO3S/c1-12-3-8-18(23-12)17-9-15-16(11-22-19(15)10-20-17)13-4-6-14(7-5-13)24(2)21/h3-11H,1-2H3
NCI pathway
Reactome pathway
n/an/a>1.00E+3n/an/an/an/an/an/a
Takeda Pharmaceutical Company, Ltd.
Curated by ChEMBL
Assay Description
Inhibition of human recombinant GSK3-beta
J Med Chem 52: 6270-86 (2009)
Article DOI: 10.1021/jm900647e
BindingDB Entry DOI: 10.7270/Q2CZ377V