BDBM50299073 3-Methyl-5-{3-[4-(methylsulfinyl)phenyl]-1-benzofuran-5-yl}-4H-1,2,4-triazole::CHEMBL576540
SMILES: Cc1nnc([nH]1)-c1ccc2occ(-c3ccc(cc3)S(C)=O)c2c1
InChI Key: InChIKey=WGABZOUQZRPBGU-UHFFFAOYSA-N
Data: 1 IC50
Activity Spreadsheet -- Enzyme Inhibition Constant Data from BindingDB
Found 1 hit for monomerid = 50299073
Trg + Lig
Ki
nM
ΔG°
kcal/mole
IC50
nM
Kd
nM
EC50/IC50
nM
koff
s-1
kon
M-1s-1
pHTemp
°C
Glycogen synthase kinase-3 beta
(Homo sapiens (Human))
BDBM50299073
(3-Methyl-5-{3-[4-(methylsulfinyl)phenyl]-1-benzofu...)
Show SMILES Cc1nnc([nH]1)-c1ccc2occ(-c3ccc(cc3)S(C)=O)c2c1
Show InChI InChI=1S/C18H15N3O2S/c1-11-19-18(21-20-11)13-5-8-17-15(9-13)16(10-23-17)12-3-6-14(7-4-12)24(2)22/h3-10H,1-2H3,(H,19,20,21)
NCI pathway
Reactome pathway
n/an/a 81n/an/an/an/an/an/a
Takeda Pharmaceutical Company, Ltd.
Curated by ChEMBL
Assay Description
Inhibition of human recombinant GSK3-beta
J Med Chem 52: 6270-86 (2009)
Article DOI: 10.1021/jm900647e
BindingDB Entry DOI: 10.7270/Q2CZ377V